解决方法:

打包跳过测试有两种方法

一是命令行

  1. mvn clean package -Dmaven.test.skip=true

二是写入pom文件

  1. <plugin>
  2. <groupId>org.apache.maven.plugins</groupId>
  3. <artifactId>maven-surefire-plugin</artifactId>
  4. <version>2.4.2</version>
  5. <configuration>
  6. <skipTests>true</skipTests>
  7. </configuration>
  8. </plugin>

mvn compile  没有问题,mvn package的时候报如下错误:

Failed to execute goal org.apache.maven.plugins:maven-surefire-plugin:2.5:test 

  1. [INFO] Scanning for projects...
  2. [INFO] ------------------------------------------------------------------------
  3. [INFO] Reactor Build Order:
  4. [INFO]
  5. [INFO] esp
  6. [INFO] parent
  7. [INFO] common
  8. [INFO] web
  9. [INFO]
  10. [INFO] ------------------------------------------------------------------------
  11. [INFO] Building esp 1.0-SNAPSHOT
  12. [INFO] ------------------------------------------------------------------------
  13. [INFO]
  14. [INFO] --- maven-clean-plugin:2.5:clean (default-clean) @ esp ---
  15. [INFO]
  16. [INFO] ------------------------------------------------------------------------
  17. [INFO] Building parent 1.0-SNAPSHOT
  18. [INFO] ------------------------------------------------------------------------
  19. [INFO]
  20. [INFO] --- maven-clean-plugin:2.5:clean (default-clean) @ esp-parent ---
  21. [INFO]
  22. [INFO] ------------------------------------------------------------------------
  23. [INFO] Building common 1.0-SNAPSHOT
  24. [INFO] ------------------------------------------------------------------------
  25. [INFO]
  26. [INFO] --- maven-clean-plugin:2.5:clean (default-clean) @ esp-common ---
  27. [INFO] Deleting E:\FOS1.0\esp\common\target
  28. [INFO]
  29. [INFO] --- maven-resources-plugin:2.6:resources (default-resources) @ esp-common ---
  30. [INFO] Using 'UTF-8' encoding to copy filtered resources.
  31. [INFO] Copying 14 resources
  32. [INFO]
  33. [INFO] --- maven-compiler-plugin:3.0:compile (default-compile) @ esp-common ---
  34. [INFO] Changes detected - recompiling the module!
  35. [INFO] Compiling 278 source files to E:\FOS1.0\esp\common\target\classes
  36. [WARNING] /E:/FOS1.0/esp/common/src/main/java/com/pcitc/common/utils/security/Coder.java:[3,16] sun.misc.BASE64Decoder是内部专用 API, 可能会在未来发行版中删除
  37. [WARNING] /E:/FOS1.0/esp/common/src/main/java/com/pcitc/common/utils/security/Coder.java:[4,16] sun.misc.BASE64Encoder是内部专用 API, 可能会在未来发行版中删除
  38. [WARNING] /E:/FOS1.0/esp/common/src/main/java/com/pcitc/common/utils/security/Coder.java:[26,32] sun.misc.BASE64Decoder是内部专用 API, 可能会在未来发行版中删除
  39. [WARNING] /E:/FOS1.0/esp/common/src/main/java/com/pcitc/common/utils/security/Coder.java:[30,21] sun.misc.BASE64Decoder是内部专用 API, 可能会在未来发行版中删除
  40. [WARNING] /E:/FOS1.0/esp/common/src/main/java/com/pcitc/common/utils/security/Coder.java:[41,21] sun.misc.BASE64Encoder是内部专用 API, 可能会在未来发行版中删除
  41. [WARNING] /E:/FOS1.0/esp/common/src/main/java/com/pcitc/common/utils/security/Coder.java:[45,21] sun.misc.BASE64Encoder是内部专用 API, 可能会在未来发行版中删除
  42. [WARNING] /E:/FOS1.0/esp/common/src/main/java/com/pcitc/common/repository/hibernate/HibernateUtils.java: 某些输入文件使用或覆盖了已过时的 API
  43. [WARNING] /E:/FOS1.0/esp/common/src/main/java/com/pcitc/common/repository/hibernate/HibernateUtils.java: 有关详细信息, 请使用 -Xlint:deprecation 重新编译。
  44. [WARNING] /E:/FOS1.0/esp/common/src/main/java/com/pcitc/common/cache/BaseCacheAspect.java: 某些输入文件使用了未经检查或不安全的操作。
  45. [WARNING] /E:/FOS1.0/esp/common/src/main/java/com/pcitc/common/cache/BaseCacheAspect.java: 有关详细信息, 请使用 -Xlint:unchecked 重新编译。
  46. [INFO]
  47. [INFO] --- maven-resources-plugin:2.6:testResources (default-testResources) @ esp-common ---
  48. [INFO] Using 'UTF-8' encoding to copy filtered resources.
  49. [INFO] Copying 0 resource
  50. [INFO] Copying 3 resources
  51. [INFO]
  52. [INFO] --- maven-compiler-plugin:3.0:testCompile (default-testCompile) @ esp-common ---
  53. [INFO] Changes detected - recompiling the module!
  54. [INFO] Compiling 56 source files to E:\FOS1.0\esp\common\target\test-classes
  55. [WARNING] /E:/FOS1.0/esp/common/src/test/java/com/pcitc/common/repository/UserRepository2Impl.java: E:\FOS1.0\esp\common\src\test\java\com\pcitc\common\repository\UserRepository2Impl.java使用了未经检查或不安全的操作。
  56. [WARNING] /E:/FOS1.0/esp/common/src/test/java/com/pcitc/common/repository/UserRepository2Impl.java: 有关详细信息, 请使用 -Xlint:unchecked 重新编译。
  57. [INFO]
  58. [INFO] --- maven-surefire-plugin:2.13:test (default-test) @ esp-common ---
  59. [INFO] Surefire report directory: E:\FOS1.0\esp\common\target\surefire-reports
  60.  
  61. -------------------------------------------------------
  62. T E S T S
  63. -------------------------------------------------------
  64. Running com.pcitc.common.entity.search.SearchableTest
  65. Tests run: 11, Failures: 0, Errors: 0, Skipped: 0, Time elapsed: 0.604 sec
  66. Running com.pcitc.common.plugin.service.MoveServiceIT
  67. Tests run: 1, Failures: 0, Errors: 1, Skipped: 0, Time elapsed: 0.017 sec <<< FAILURE!
  68. initializationError(com.pcitc.common.plugin.service.MoveServiceIT) Time elapsed: 0.008 sec <<< ERROR!
  69. java.lang.NoClassDefFoundError: org/springframework/core/annotation/AnnotatedElementUtils
  70. at java.net.URLClassLoader$1.run(URLClassLoader.java:366)
  71. at java.net.URLClassLoader$1.run(URLClassLoader.java:355)
  72. at java.security.AccessController.doPrivileged(Native Method)
  73. at java.net.URLClassLoader.findClass(URLClassLoader.java:354)
  74. at java.lang.ClassLoader.loadClass(ClassLoader.java:425)
  75. at sun.misc.Launcher$AppClassLoader.loadClass(Launcher.java:308)
  76. at java.lang.ClassLoader.loadClass(ClassLoader.java:358)
  77. at org.springframework.test.context.MetaAnnotationUtils$AnnotationDescriptor.<init>(MetaAnnotationUtils.java:269)
  78. at org.springframework.test.context.MetaAnnotationUtils$AnnotationDescriptor.<init>(MetaAnnotationUtils.java:257)
  79. at org.springframework.test.context.MetaAnnotationUtils$UntypedAnnotationDescriptor.<init>(MetaAnnotationUtils.java:326)
  80. at org.springframework.test.context.MetaAnnotationUtils.findAnnotationDescriptorForTypes(MetaAnnotationUtils.java:171)
  81. at org.springframework.test.context.MetaAnnotationUtils.findAnnotationDescriptorForTypes(MetaAnnotationUtils.java:188)
  82. at org.springframework.test.context.ContextLoaderUtils.buildMergedContextConfiguration(ContextLoaderUtils.java:621)
  83. at org.springframework.test.context.DefaultTestContext.<init>(DefaultTestContext.java:93)
  84. at org.springframework.test.context.TestContextManager.<init>(TestContextManager.java:119)
  85. at org.springframework.test.context.junit4.SpringJUnit4ClassRunner.createTestContextManager(SpringJUnit4ClassRunner.java:120)
  86. at org.springframework.test.context.junit4.SpringJUnit4ClassRunner.<init>(SpringJUnit4ClassRunner.java:109)
  87. at sun.reflect.NativeConstructorAccessorImpl.newInstance0(Native Method)
  88. at sun.reflect.NativeConstructorAccessorImpl.newInstance(NativeConstructorAccessorImpl.java:57)
  89. at sun.reflect.DelegatingConstructorAccessorImpl.newInstance(DelegatingConstructorAccessorImpl.java:45)
  90. at java.lang.reflect.Constructor.newInstance(Constructor.java:526)
  91. at org.junit.internal.builders.AnnotatedBuilder.buildRunner(AnnotatedBuilder.java:29)
  92. at org.junit.internal.builders.AnnotatedBuilder.runnerForClass(AnnotatedBuilder.java:21)
  93. at org.junit.runners.model.RunnerBuilder.safeRunnerForClass(RunnerBuilder.java:59)
  94. at org.junit.internal.builders.AllDefaultPossibilitiesBuilder.runnerForClass(AllDefaultPossibilitiesBuilder.java:26)
  95. at org.junit.runners.model.RunnerBuilder.safeRunnerForClass(RunnerBuilder.java:59)
  96. at org.junit.internal.requests.ClassRequest.getRunner(ClassRequest.java:26)
  97. at org.apache.maven.surefire.junit4.JUnit4Provider.execute(JUnit4Provider.java:262)
  98. at org.apache.maven.surefire.junit4.JUnit4Provider.executeTestSet(JUnit4Provider.java:153)
  99. at org.apache.maven.surefire.junit4.JUnit4Provider.invoke(JUnit4Provider.java:124)
  100. at sun.reflect.NativeMethodAccessorImpl.invoke0(Native Method)
  101. at sun.reflect.NativeMethodAccessorImpl.invoke(NativeMethodAccessorImpl.java:57)
  102. at sun.reflect.DelegatingMethodAccessorImpl.invoke(DelegatingMethodAccessorImpl.java:43)
  103. at java.lang.reflect.Method.invoke(Method.java:606)
  104. at org.apache.maven.surefire.util.ReflectionUtils.invokeMethodWithArray2(ReflectionUtils.java:208)
  105. at org.apache.maven.surefire.booter.ProviderFactory$ProviderProxy.invoke(ProviderFactory.java:158)
  106. at org.apache.maven.surefire.booter.ProviderFactory.invokeProvider(ProviderFactory.java:86)
  107. at org.apache.maven.surefire.booter.ForkedBooter.runSuitesInProcess(ForkedBooter.java:153)
  108. at org.apache.maven.surefire.booter.ForkedBooter.main(ForkedBooter.java:95)
  109.  
  110. Running com.pcitc.common.plugin.service.TreeServiceIT
  111. Tests run: 1, Failures: 0, Errors: 1, Skipped: 0, Time elapsed: 0.001 sec <<< FAILURE!
  112. initializationError(com.pcitc.common.plugin.service.TreeServiceIT) Time elapsed: 0.001 sec <<< ERROR!
  113. java.lang.NoClassDefFoundError: org/springframework/core/annotation/AnnotatedElementUtils
  114. at org.springframework.test.context.MetaAnnotationUtils$AnnotationDescriptor.<init>(MetaAnnotationUtils.java:269)
  115. at org.springframework.test.context.MetaAnnotationUtils$AnnotationDescriptor.<init>(MetaAnnotationUtils.java:257)
  116. at org.springframework.test.context.MetaAnnotationUtils$UntypedAnnotationDescriptor.<init>(MetaAnnotationUtils.java:326)
  117. at org.springframework.test.context.MetaAnnotationUtils.findAnnotationDescriptorForTypes(MetaAnnotationUtils.java:171)
  118. at org.springframework.test.context.MetaAnnotationUtils.findAnnotationDescriptorForTypes(MetaAnnotationUtils.java:188)
  119. at org.springframework.test.context.ContextLoaderUtils.buildMergedContextConfiguration(ContextLoaderUtils.java:621)
  120. at org.springframework.test.context.DefaultTestContext.<init>(DefaultTestContext.java:93)
  121. at org.springframework.test.context.TestContextManager.<init>(TestContextManager.java:119)
  122. at org.springframework.test.context.junit4.SpringJUnit4ClassRunner.createTestContextManager(SpringJUnit4ClassRunner.java:120)
  123. at org.springframework.test.context.junit4.SpringJUnit4ClassRunner.<init>(SpringJUnit4ClassRunner.java:109)
  124. at sun.reflect.NativeConstructorAccessorImpl.newInstance0(Native Method)
  125. at sun.reflect.NativeConstructorAccessorImpl.newInstance(NativeConstructorAccessorImpl.java:57)
  126. at sun.reflect.DelegatingConstructorAccessorImpl.newInstance(DelegatingConstructorAccessorImpl.java:45)
  127. at java.lang.reflect.Constructor.newInstance(Constructor.java:526)
  128. at org.junit.internal.builders.AnnotatedBuilder.buildRunner(AnnotatedBuilder.java:29)
  129. at org.junit.internal.builders.AnnotatedBuilder.runnerForClass(AnnotatedBuilder.java:21)
  130. at org.junit.runners.model.RunnerBuilder.safeRunnerForClass(RunnerBuilder.java:59)
  131. at org.junit.internal.builders.AllDefaultPossibilitiesBuilder.runnerForClass(AllDefaultPossibilitiesBuilder.java:26)
  132. at org.junit.runners.model.RunnerBuilder.safeRunnerForClass(RunnerBuilder.java:59)
  133. at org.junit.internal.requests.ClassRequest.getRunner(ClassRequest.java:26)
  134. at org.apache.maven.surefire.junit4.JUnit4Provider.execute(JUnit4Provider.java:262)
  135. at org.apache.maven.surefire.junit4.JUnit4Provider.executeTestSet(JUnit4Provider.java:153)
  136. at org.apache.maven.surefire.junit4.JUnit4Provider.invoke(JUnit4Provider.java:124)
  137. at sun.reflect.NativeMethodAccessorImpl.invoke0(Native Method)
  138. at sun.reflect.NativeMethodAccessorImpl.invoke(NativeMethodAccessorImpl.java:57)
  139. at sun.reflect.DelegatingMethodAccessorImpl.invoke(DelegatingMethodAccessorImpl.java:43)
  140. at java.lang.reflect.Method.invoke(Method.java:606)
  141. at org.apache.maven.surefire.util.ReflectionUtils.invokeMethodWithArray2(ReflectionUtils.java:208)
  142. at org.apache.maven.surefire.booter.ProviderFactory$ProviderProxy.invoke(ProviderFactory.java:158)
  143. at org.apache.maven.surefire.booter.ProviderFactory.invokeProvider(ProviderFactory.java:86)
  144. at org.apache.maven.surefire.booter.ForkedBooter.runSuitesInProcess(ForkedBooter.java:153)
  145. at org.apache.maven.surefire.booter.ForkedBooter.main(ForkedBooter.java:95)
  146.  
  147. Running com.pcitc.common.repository.CRUDUserRepositoryIT
  148. Tests run: 1, Failures: 0, Errors: 1, Skipped: 0, Time elapsed: 0.001 sec <<< FAILURE!
  149. initializationError(com.pcitc.common.repository.CRUDUserRepositoryIT) Time elapsed: 0.001 sec <<< ERROR!
  150. java.lang.NoClassDefFoundError: org/springframework/core/annotation/AnnotatedElementUtils
  151. at org.springframework.test.context.MetaAnnotationUtils$AnnotationDescriptor.<init>(MetaAnnotationUtils.java:269)
  152. at org.springframework.test.context.MetaAnnotationUtils$AnnotationDescriptor.<init>(MetaAnnotationUtils.java:257)
  153. at org.springframework.test.context.MetaAnnotationUtils$UntypedAnnotationDescriptor.<init>(MetaAnnotationUtils.java:326)
  154. at org.springframework.test.context.MetaAnnotationUtils.findAnnotationDescriptorForTypes(MetaAnnotationUtils.java:171)
  155. at org.springframework.test.context.MetaAnnotationUtils.findAnnotationDescriptorForTypes(MetaAnnotationUtils.java:188)
  156. at org.springframework.test.context.MetaAnnotationUtils.findAnnotationDescriptorForTypes(MetaAnnotationUtils.java:188)
  157. at org.springframework.test.context.ContextLoaderUtils.buildMergedContextConfiguration(ContextLoaderUtils.java:621)
  158. at org.springframework.test.context.DefaultTestContext.<init>(DefaultTestContext.java:93)
  159. at org.springframework.test.context.TestContextManager.<init>(TestContextManager.java:119)
  160. at org.springframework.test.context.junit4.SpringJUnit4ClassRunner.createTestContextManager(SpringJUnit4ClassRunner.java:120)
  161. at org.springframework.test.context.junit4.SpringJUnit4ClassRunner.<init>(SpringJUnit4ClassRunner.java:109)
  162. at sun.reflect.NativeConstructorAccessorImpl.newInstance0(Native Method)
  163. at sun.reflect.NativeConstructorAccessorImpl.newInstance(NativeConstructorAccessorImpl.java:57)
  164. at sun.reflect.DelegatingConstructorAccessorImpl.newInstance(DelegatingConstructorAccessorImpl.java:45)
  165. at java.lang.reflect.Constructor.newInstance(Constructor.java:526)
  166. at org.junit.internal.builders.AnnotatedBuilder.buildRunner(AnnotatedBuilder.java:29)
  167. at org.junit.internal.builders.AnnotatedBuilder.runnerForClass(AnnotatedBuilder.java:21)
  168. at org.junit.runners.model.RunnerBuilder.safeRunnerForClass(RunnerBuilder.java:59)
  169. at org.junit.internal.builders.AllDefaultPossibilitiesBuilder.runnerForClass(AllDefaultPossibilitiesBuilder.java:26)
  170. at org.junit.runners.model.RunnerBuilder.safeRunnerForClass(RunnerBuilder.java:59)
  171. at org.junit.internal.requests.ClassRequest.getRunner(ClassRequest.java:26)
  172. at org.apache.maven.surefire.junit4.JUnit4Provider.execute(JUnit4Provider.java:262)
  173. at org.apache.maven.surefire.junit4.JUnit4Provider.executeTestSet(JUnit4Provider.java:153)
  174. at org.apache.maven.surefire.junit4.JUnit4Provider.invoke(JUnit4Provider.java:124)
  175. at sun.reflect.NativeMethodAccessorImpl.invoke0(Native Method)
  176. at sun.reflect.NativeMethodAccessorImpl.invoke(NativeMethodAccessorImpl.java:57)
  177. at sun.reflect.DelegatingMethodAccessorImpl.invoke(DelegatingMethodAccessorImpl.java:43)
  178. at java.lang.reflect.Method.invoke(Method.java:606)
  179. at org.apache.maven.surefire.util.ReflectionUtils.invokeMethodWithArray2(ReflectionUtils.java:208)
  180. at org.apache.maven.surefire.booter.ProviderFactory$ProviderProxy.invoke(ProviderFactory.java:158)
  181. at org.apache.maven.surefire.booter.ProviderFactory.invokeProvider(ProviderFactory.java:86)
  182. at org.apache.maven.surefire.booter.ForkedBooter.runSuitesInProcess(ForkedBooter.java:153)
  183. at org.apache.maven.surefire.booter.ForkedBooter.main(ForkedBooter.java:95)
  184.  
  185. Running com.pcitc.common.repository.PageAndSortUserRepositoryIT
  186. Tests run: 1, Failures: 0, Errors: 1, Skipped: 0, Time elapsed: 0 sec <<< FAILURE!
  187. initializationError(com.pcitc.common.repository.PageAndSortUserRepositoryIT) Time elapsed: 0 sec <<< ERROR!
  188. java.lang.NoClassDefFoundError: org/springframework/core/annotation/AnnotatedElementUtils
  189. at org.springframework.test.context.MetaAnnotationUtils$AnnotationDescriptor.<init>(MetaAnnotationUtils.java:269)
  190. at org.springframework.test.context.MetaAnnotationUtils$AnnotationDescriptor.<init>(MetaAnnotationUtils.java:257)
  191. at org.springframework.test.context.MetaAnnotationUtils$UntypedAnnotationDescriptor.<init>(MetaAnnotationUtils.java:326)
  192. at org.springframework.test.context.MetaAnnotationUtils.findAnnotationDescriptorForTypes(MetaAnnotationUtils.java:171)
  193. at org.springframework.test.context.MetaAnnotationUtils.findAnnotationDescriptorForTypes(MetaAnnotationUtils.java:188)
  194. at org.springframework.test.context.MetaAnnotationUtils.findAnnotationDescriptorForTypes(MetaAnnotationUtils.java:188)
  195. at org.springframework.test.context.ContextLoaderUtils.buildMergedContextConfiguration(ContextLoaderUtils.java:621)
  196. at org.springframework.test.context.DefaultTestContext.<init>(DefaultTestContext.java:93)
  197. at org.springframework.test.context.TestContextManager.<init>(TestContextManager.java:119)
  198. at org.springframework.test.context.junit4.SpringJUnit4ClassRunner.createTestContextManager(SpringJUnit4ClassRunner.java:120)
  199. at org.springframework.test.context.junit4.SpringJUnit4ClassRunner.<init>(SpringJUnit4ClassRunner.java:109)
  200. at sun.reflect.NativeConstructorAccessorImpl.newInstance0(Native Method)
  201. at sun.reflect.NativeConstructorAccessorImpl.newInstance(NativeConstructorAccessorImpl.java:57)
  202. at sun.reflect.DelegatingConstructorAccessorImpl.newInstance(DelegatingConstructorAccessorImpl.java:45)
  203. at java.lang.reflect.Constructor.newInstance(Constructor.java:526)
  204. at org.junit.internal.builders.AnnotatedBuilder.buildRunner(AnnotatedBuilder.java:29)
  205. at org.junit.internal.builders.AnnotatedBuilder.runnerForClass(AnnotatedBuilder.java:21)
  206. at org.junit.runners.model.RunnerBuilder.safeRunnerForClass(RunnerBuilder.java:59)
  207. at org.junit.internal.builders.AllDefaultPossibilitiesBuilder.runnerForClass(AllDefaultPossibilitiesBuilder.java:26)
  208. at org.junit.runners.model.RunnerBuilder.safeRunnerForClass(RunnerBuilder.java:59)
  209. at org.junit.internal.requests.ClassRequest.getRunner(ClassRequest.java:26)
  210. at org.apache.maven.surefire.junit4.JUnit4Provider.execute(JUnit4Provider.java:262)
  211. at org.apache.maven.surefire.junit4.JUnit4Provider.executeTestSet(JUnit4Provider.java:153)
  212. at org.apache.maven.surefire.junit4.JUnit4Provider.invoke(JUnit4Provider.java:124)
  213. at sun.reflect.NativeMethodAccessorImpl.invoke0(Native Method)
  214. at sun.reflect.NativeMethodAccessorImpl.invoke(NativeMethodAccessorImpl.java:57)
  215. at sun.reflect.DelegatingMethodAccessorImpl.invoke(DelegatingMethodAccessorImpl.java:43)
  216. at java.lang.reflect.Method.invoke(Method.java:606)
  217. at org.apache.maven.surefire.util.ReflectionUtils.invokeMethodWithArray2(ReflectionUtils.java:208)
  218. at org.apache.maven.surefire.booter.ProviderFactory$ProviderProxy.invoke(ProviderFactory.java:158)
  219. at org.apache.maven.surefire.booter.ProviderFactory.invokeProvider(ProviderFactory.java:86)
  220. at org.apache.maven.surefire.booter.ForkedBooter.runSuitesInProcess(ForkedBooter.java:153)
  221. at org.apache.maven.surefire.booter.ForkedBooter.main(ForkedBooter.java:95)
  222.  
  223. Running com.pcitc.common.repository.RepositoryHelperIT
  224. Tests run: 1, Failures: 0, Errors: 1, Skipped: 0, Time elapsed: 0.001 sec <<< FAILURE!
  225. initializationError(com.pcitc.common.repository.RepositoryHelperIT) Time elapsed: 0.001 sec <<< ERROR!
  226. java.lang.NoClassDefFoundError: org/springframework/core/annotation/AnnotatedElementUtils
  227. at org.springframework.test.context.MetaAnnotationUtils$AnnotationDescriptor.<init>(MetaAnnotationUtils.java:269)
  228. at org.springframework.test.context.MetaAnnotationUtils$AnnotationDescriptor.<init>(MetaAnnotationUtils.java:257)
  229. at org.springframework.test.context.MetaAnnotationUtils$UntypedAnnotationDescriptor.<init>(MetaAnnotationUtils.java:326)
  230. at org.springframework.test.context.MetaAnnotationUtils.findAnnotationDescriptorForTypes(MetaAnnotationUtils.java:171)
  231. at org.springframework.test.context.MetaAnnotationUtils.findAnnotationDescriptorForTypes(MetaAnnotationUtils.java:188)
  232. at org.springframework.test.context.MetaAnnotationUtils.findAnnotationDescriptorForTypes(MetaAnnotationUtils.java:188)
  233. at org.springframework.test.context.ContextLoaderUtils.buildMergedContextConfiguration(ContextLoaderUtils.java:621)
  234. at org.springframework.test.context.DefaultTestContext.<init>(DefaultTestContext.java:93)
  235. at org.springframework.test.context.TestContextManager.<init>(TestContextManager.java:119)
  236. at org.springframework.test.context.junit4.SpringJUnit4ClassRunner.createTestContextManager(SpringJUnit4ClassRunner.java:120)
  237. at org.springframework.test.context.junit4.SpringJUnit4ClassRunner.<init>(SpringJUnit4ClassRunner.java:109)
  238. at sun.reflect.NativeConstructorAccessorImpl.newInstance0(Native Method)
  239. at sun.reflect.NativeConstructorAccessorImpl.newInstance(NativeConstructorAccessorImpl.java:57)
  240. at sun.reflect.DelegatingConstructorAccessorImpl.newInstance(DelegatingConstructorAccessorImpl.java:45)
  241. at java.lang.reflect.Constructor.newInstance(Constructor.java:526)
  242. at org.junit.internal.builders.AnnotatedBuilder.buildRunner(AnnotatedBuilder.java:29)
  243. at org.junit.internal.builders.AnnotatedBuilder.runnerForClass(AnnotatedBuilder.java:21)
  244. at org.junit.runners.model.RunnerBuilder.safeRunnerForClass(RunnerBuilder.java:59)
  245. at org.junit.internal.builders.AllDefaultPossibilitiesBuilder.runnerForClass(AllDefaultPossibilitiesBuilder.java:26)
  246. at org.junit.runners.model.RunnerBuilder.safeRunnerForClass(RunnerBuilder.java:59)
  247. at org.junit.internal.requests.ClassRequest.getRunner(ClassRequest.java:26)
  248. at org.apache.maven.surefire.junit4.JUnit4Provider.execute(JUnit4Provider.java:262)
  249. at org.apache.maven.surefire.junit4.JUnit4Provider.executeTestSet(JUnit4Provider.java:153)
  250. at org.apache.maven.surefire.junit4.JUnit4Provider.invoke(JUnit4Provider.java:124)
  251. at sun.reflect.NativeMethodAccessorImpl.invoke0(Native Method)
  252. at sun.reflect.NativeMethodAccessorImpl.invoke(NativeMethodAccessorImpl.java:57)
  253. at sun.reflect.DelegatingMethodAccessorImpl.invoke(DelegatingMethodAccessorImpl.java:43)
  254. at java.lang.reflect.Method.invoke(Method.java:606)
  255. at org.apache.maven.surefire.util.ReflectionUtils.invokeMethodWithArray2(ReflectionUtils.java:208)
  256. at org.apache.maven.surefire.booter.ProviderFactory$ProviderProxy.invoke(ProviderFactory.java:158)
  257. at org.apache.maven.surefire.booter.ProviderFactory.invokeProvider(ProviderFactory.java:86)
  258. at org.apache.maven.surefire.booter.ForkedBooter.runSuitesInProcess(ForkedBooter.java:153)
  259. at org.apache.maven.surefire.booter.ForkedBooter.main(ForkedBooter.java:95)
  260.  
  261. Running com.pcitc.common.repository.search.SearchUserRepository2WithRepository2ImpIT
  262. Tests run: 1, Failures: 0, Errors: 1, Skipped: 0, Time elapsed: 0.001 sec <<< FAILURE!
  263. initializationError(com.pcitc.common.repository.search.SearchUserRepository2WithRepository2ImpIT) Time elapsed: 0 sec <<< ERROR!
  264. java.lang.NoClassDefFoundError: org/springframework/core/annotation/AnnotatedElementUtils
  265. at org.springframework.test.context.MetaAnnotationUtils$AnnotationDescriptor.<init>(MetaAnnotationUtils.java:269)
  266. at org.springframework.test.context.MetaAnnotationUtils$AnnotationDescriptor.<init>(MetaAnnotationUtils.java:257)
  267. at org.springframework.test.context.MetaAnnotationUtils$UntypedAnnotationDescriptor.<init>(MetaAnnotationUtils.java:326)
  268. at org.springframework.test.context.MetaAnnotationUtils.findAnnotationDescriptorForTypes(MetaAnnotationUtils.java:171)
  269. at org.springframework.test.context.MetaAnnotationUtils.findAnnotationDescriptorForTypes(MetaAnnotationUtils.java:188)
  270. at org.springframework.test.context.MetaAnnotationUtils.findAnnotationDescriptorForTypes(MetaAnnotationUtils.java:188)
  271. at org.springframework.test.context.ContextLoaderUtils.buildMergedContextConfiguration(ContextLoaderUtils.java:621)
  272. at org.springframework.test.context.DefaultTestContext.<init>(DefaultTestContext.java:93)
  273. at org.springframework.test.context.TestContextManager.<init>(TestContextManager.java:119)
  274. at org.springframework.test.context.junit4.SpringJUnit4ClassRunner.createTestContextManager(SpringJUnit4ClassRunner.java:120)
  275. at org.springframework.test.context.junit4.SpringJUnit4ClassRunner.<init>(SpringJUnit4ClassRunner.java:109)
  276. at sun.reflect.NativeConstructorAccessorImpl.newInstance0(Native Method)
  277. at sun.reflect.NativeConstructorAccessorImpl.newInstance(NativeConstructorAccessorImpl.java:57)
  278. at sun.reflect.DelegatingConstructorAccessorImpl.newInstance(DelegatingConstructorAccessorImpl.java:45)
  279. at java.lang.reflect.Constructor.newInstance(Constructor.java:526)
  280. at org.junit.internal.builders.AnnotatedBuilder.buildRunner(AnnotatedBuilder.java:29)
  281. at org.junit.internal.builders.AnnotatedBuilder.runnerForClass(AnnotatedBuilder.java:21)
  282. at org.junit.runners.model.RunnerBuilder.safeRunnerForClass(RunnerBuilder.java:59)
  283. at org.junit.internal.builders.AllDefaultPossibilitiesBuilder.runnerForClass(AllDefaultPossibilitiesBuilder.java:26)
  284. at org.junit.runners.model.RunnerBuilder.safeRunnerForClass(RunnerBuilder.java:59)
  285. at org.junit.internal.requests.ClassRequest.getRunner(ClassRequest.java:26)
  286. at org.apache.maven.surefire.junit4.JUnit4Provider.execute(JUnit4Provider.java:262)
  287. at org.apache.maven.surefire.junit4.JUnit4Provider.executeTestSet(JUnit4Provider.java:153)
  288. at org.apache.maven.surefire.junit4.JUnit4Provider.invoke(JUnit4Provider.java:124)
  289. at sun.reflect.NativeMethodAccessorImpl.invoke0(Native Method)
  290. at sun.reflect.NativeMethodAccessorImpl.invoke(NativeMethodAccessorImpl.java:57)
  291. at sun.reflect.DelegatingMethodAccessorImpl.invoke(DelegatingMethodAccessorImpl.java:43)
  292. at java.lang.reflect.Method.invoke(Method.java:606)
  293. at org.apache.maven.surefire.util.ReflectionUtils.invokeMethodWithArray2(ReflectionUtils.java:208)
  294. at org.apache.maven.surefire.booter.ProviderFactory$ProviderProxy.invoke(ProviderFactory.java:158)
  295. at org.apache.maven.surefire.booter.ProviderFactory.invokeProvider(ProviderFactory.java:86)
  296. at org.apache.maven.surefire.booter.ForkedBooter.runSuitesInProcess(ForkedBooter.java:153)
  297. at org.apache.maven.surefire.booter.ForkedBooter.main(ForkedBooter.java:95)
  298.  
  299. Running com.pcitc.common.repository.search.SearchUserRepositoryIT
  300. Tests run: 1, Failures: 0, Errors: 1, Skipped: 0, Time elapsed: 0 sec <<< FAILURE!
  301. initializationError(com.pcitc.common.repository.search.SearchUserRepositoryIT) Time elapsed: 0 sec <<< ERROR!
  302. java.lang.NoClassDefFoundError: org/springframework/core/annotation/AnnotatedElementUtils
  303. at org.springframework.test.context.MetaAnnotationUtils$AnnotationDescriptor.<init>(MetaAnnotationUtils.java:269)
  304. at org.springframework.test.context.MetaAnnotationUtils$AnnotationDescriptor.<init>(MetaAnnotationUtils.java:257)
  305. at org.springframework.test.context.MetaAnnotationUtils$UntypedAnnotationDescriptor.<init>(MetaAnnotationUtils.java:326)
  306. at org.springframework.test.context.MetaAnnotationUtils.findAnnotationDescriptorForTypes(MetaAnnotationUtils.java:171)
  307. at org.springframework.test.context.MetaAnnotationUtils.findAnnotationDescriptorForTypes(MetaAnnotationUtils.java:188)
  308. at org.springframework.test.context.MetaAnnotationUtils.findAnnotationDescriptorForTypes(MetaAnnotationUtils.java:188)
  309. at org.springframework.test.context.ContextLoaderUtils.buildMergedContextConfiguration(ContextLoaderUtils.java:621)
  310. at org.springframework.test.context.DefaultTestContext.<init>(DefaultTestContext.java:93)
  311. at org.springframework.test.context.TestContextManager.<init>(TestContextManager.java:119)
  312. at org.springframework.test.context.junit4.SpringJUnit4ClassRunner.createTestContextManager(SpringJUnit4ClassRunner.java:120)
  313. at org.springframework.test.context.junit4.SpringJUnit4ClassRunner.<init>(SpringJUnit4ClassRunner.java:109)
  314. at sun.reflect.NativeConstructorAccessorImpl.newInstance0(Native Method)
  315. at sun.reflect.NativeConstructorAccessorImpl.newInstance(NativeConstructorAccessorImpl.java:57)
  316. at sun.reflect.DelegatingConstructorAccessorImpl.newInstance(DelegatingConstructorAccessorImpl.java:45)
  317. at java.lang.reflect.Constructor.newInstance(Constructor.java:526)
  318. at org.junit.internal.builders.AnnotatedBuilder.buildRunner(AnnotatedBuilder.java:29)
  319. at org.junit.internal.builders.AnnotatedBuilder.runnerForClass(AnnotatedBuilder.java:21)
  320. at org.junit.runners.model.RunnerBuilder.safeRunnerForClass(RunnerBuilder.java:59)
  321. at org.junit.internal.builders.AllDefaultPossibilitiesBuilder.runnerForClass(AllDefaultPossibilitiesBuilder.java:26)
  322. at org.junit.runners.model.RunnerBuilder.safeRunnerForClass(RunnerBuilder.java:59)
  323. at org.junit.internal.requests.ClassRequest.getRunner(ClassRequest.java:26)
  324. at org.apache.maven.surefire.junit4.JUnit4Provider.execute(JUnit4Provider.java:262)
  325. at org.apache.maven.surefire.junit4.JUnit4Provider.executeTestSet(JUnit4Provider.java:153)
  326. at org.apache.maven.surefire.junit4.JUnit4Provider.invoke(JUnit4Provider.java:124)
  327. at sun.reflect.NativeMethodAccessorImpl.invoke0(Native Method)
  328. at sun.reflect.NativeMethodAccessorImpl.invoke(NativeMethodAccessorImpl.java:57)
  329. at sun.reflect.DelegatingMethodAccessorImpl.invoke(DelegatingMethodAccessorImpl.java:43)
  330. at java.lang.reflect.Method.invoke(Method.java:606)
  331. at org.apache.maven.surefire.util.ReflectionUtils.invokeMethodWithArray2(ReflectionUtils.java:208)
  332. at org.apache.maven.surefire.booter.ProviderFactory$ProviderProxy.invoke(ProviderFactory.java:158)
  333. at org.apache.maven.surefire.booter.ProviderFactory.invokeProvider(ProviderFactory.java:86)
  334. at org.apache.maven.surefire.booter.ForkedBooter.runSuitesInProcess(ForkedBooter.java:153)
  335. at org.apache.maven.surefire.booter.ForkedBooter.main(ForkedBooter.java:95)
  336.  
  337. Running com.pcitc.common.repository.SpecificationUserRepositoryIT
  338. Tests run: 1, Failures: 0, Errors: 1, Skipped: 0, Time elapsed: 0 sec <<< FAILURE!
  339. initializationError(com.pcitc.common.repository.SpecificationUserRepositoryIT) Time elapsed: 0 sec <<< ERROR!
  340. java.lang.NoClassDefFoundError: org/springframework/core/annotation/AnnotatedElementUtils
  341. at org.springframework.test.context.MetaAnnotationUtils$AnnotationDescriptor.<init>(MetaAnnotationUtils.java:269)
  342. at org.springframework.test.context.MetaAnnotationUtils$AnnotationDescriptor.<init>(MetaAnnotationUtils.java:257)
  343. at org.springframework.test.context.MetaAnnotationUtils$UntypedAnnotationDescriptor.<init>(MetaAnnotationUtils.java:326)
  344. at org.springframework.test.context.MetaAnnotationUtils.findAnnotationDescriptorForTypes(MetaAnnotationUtils.java:171)
  345. at org.springframework.test.context.MetaAnnotationUtils.findAnnotationDescriptorForTypes(MetaAnnotationUtils.java:188)
  346. at org.springframework.test.context.MetaAnnotationUtils.findAnnotationDescriptorForTypes(MetaAnnotationUtils.java:188)
  347. at org.springframework.test.context.ContextLoaderUtils.buildMergedContextConfiguration(ContextLoaderUtils.java:621)
  348. at org.springframework.test.context.DefaultTestContext.<init>(DefaultTestContext.java:93)
  349. at org.springframework.test.context.TestContextManager.<init>(TestContextManager.java:119)
  350. at org.springframework.test.context.junit4.SpringJUnit4ClassRunner.createTestContextManager(SpringJUnit4ClassRunner.java:120)
  351. at org.springframework.test.context.junit4.SpringJUnit4ClassRunner.<init>(SpringJUnit4ClassRunner.java:109)
  352. at sun.reflect.NativeConstructorAccessorImpl.newInstance0(Native Method)
  353. at sun.reflect.NativeConstructorAccessorImpl.newInstance(NativeConstructorAccessorImpl.java:57)
  354. at sun.reflect.DelegatingConstructorAccessorImpl.newInstance(DelegatingConstructorAccessorImpl.java:45)
  355. at java.lang.reflect.Constructor.newInstance(Constructor.java:526)
  356. at org.junit.internal.builders.AnnotatedBuilder.buildRunner(AnnotatedBuilder.java:29)
  357. at org.junit.internal.builders.AnnotatedBuilder.runnerForClass(AnnotatedBuilder.java:21)
  358. at org.junit.runners.model.RunnerBuilder.safeRunnerForClass(RunnerBuilder.java:59)
  359. at org.junit.internal.builders.AllDefaultPossibilitiesBuilder.runnerForClass(AllDefaultPossibilitiesBuilder.java:26)
  360. at org.junit.runners.model.RunnerBuilder.safeRunnerForClass(RunnerBuilder.java:59)
  361. at org.junit.internal.requests.ClassRequest.getRunner(ClassRequest.java:26)
  362. at org.apache.maven.surefire.junit4.JUnit4Provider.execute(JUnit4Provider.java:262)
  363. at org.apache.maven.surefire.junit4.JUnit4Provider.executeTestSet(JUnit4Provider.java:153)
  364. at org.apache.maven.surefire.junit4.JUnit4Provider.invoke(JUnit4Provider.java:124)
  365. at sun.reflect.NativeMethodAccessorImpl.invoke0(Native Method)
  366. at sun.reflect.NativeMethodAccessorImpl.invoke(NativeMethodAccessorImpl.java:57)
  367. at sun.reflect.DelegatingMethodAccessorImpl.invoke(DelegatingMethodAccessorImpl.java:43)
  368. at java.lang.reflect.Method.invoke(Method.java:606)
  369. at org.apache.maven.surefire.util.ReflectionUtils.invokeMethodWithArray2(ReflectionUtils.java:208)
  370. at org.apache.maven.surefire.booter.ProviderFactory$ProviderProxy.invoke(ProviderFactory.java:158)
  371. at org.apache.maven.surefire.booter.ProviderFactory.invokeProvider(ProviderFactory.java:86)
  372. at org.apache.maven.surefire.booter.ForkedBooter.runSuitesInProcess(ForkedBooter.java:153)
  373. at org.apache.maven.surefire.booter.ForkedBooter.main(ForkedBooter.java:95)
  374.  
  375. Running com.pcitc.common.repository.UserRepository2ImplForCustomSearchIT
  376. Tests run: 1, Failures: 0, Errors: 1, Skipped: 0, Time elapsed: 0.001 sec <<< FAILURE!
  377. initializationError(com.pcitc.common.repository.UserRepository2ImplForCustomSearchIT) Time elapsed: 0.001 sec <<< ERROR!
  378. java.lang.NoClassDefFoundError: org/springframework/core/annotation/AnnotatedElementUtils
  379. at org.springframework.test.context.MetaAnnotationUtils$AnnotationDescriptor.<init>(MetaAnnotationUtils.java:269)
  380. at org.springframework.test.context.MetaAnnotationUtils$AnnotationDescriptor.<init>(MetaAnnotationUtils.java:257)
  381. at org.springframework.test.context.MetaAnnotationUtils$UntypedAnnotationDescriptor.<init>(MetaAnnotationUtils.java:326)
  382. at org.springframework.test.context.MetaAnnotationUtils.findAnnotationDescriptorForTypes(MetaAnnotationUtils.java:171)
  383. at org.springframework.test.context.MetaAnnotationUtils.findAnnotationDescriptorForTypes(MetaAnnotationUtils.java:188)
  384. at org.springframework.test.context.MetaAnnotationUtils.findAnnotationDescriptorForTypes(MetaAnnotationUtils.java:188)
  385. at org.springframework.test.context.ContextLoaderUtils.buildMergedContextConfiguration(ContextLoaderUtils.java:621)
  386. at org.springframework.test.context.DefaultTestContext.<init>(DefaultTestContext.java:93)
  387. at org.springframework.test.context.TestContextManager.<init>(TestContextManager.java:119)
  388. at org.springframework.test.context.junit4.SpringJUnit4ClassRunner.createTestContextManager(SpringJUnit4ClassRunner.java:120)
  389. at org.springframework.test.context.junit4.SpringJUnit4ClassRunner.<init>(SpringJUnit4ClassRunner.java:109)
  390. at sun.reflect.NativeConstructorAccessorImpl.newInstance0(Native Method)
  391. at sun.reflect.NativeConstructorAccessorImpl.newInstance(NativeConstructorAccessorImpl.java:57)
  392. at sun.reflect.DelegatingConstructorAccessorImpl.newInstance(DelegatingConstructorAccessorImpl.java:45)
  393. at java.lang.reflect.Constructor.newInstance(Constructor.java:526)
  394. at org.junit.internal.builders.AnnotatedBuilder.buildRunner(AnnotatedBuilder.java:29)
  395. at org.junit.internal.builders.AnnotatedBuilder.runnerForClass(AnnotatedBuilder.java:21)
  396. at org.junit.runners.model.RunnerBuilder.safeRunnerForClass(RunnerBuilder.java:59)
  397. at org.junit.internal.builders.AllDefaultPossibilitiesBuilder.runnerForClass(AllDefaultPossibilitiesBuilder.java:26)
  398. at org.junit.runners.model.RunnerBuilder.safeRunnerForClass(RunnerBuilder.java:59)
  399. at org.junit.internal.requests.ClassRequest.getRunner(ClassRequest.java:26)
  400. at org.apache.maven.surefire.junit4.JUnit4Provider.execute(JUnit4Provider.java:262)
  401. at org.apache.maven.surefire.junit4.JUnit4Provider.executeTestSet(JUnit4Provider.java:153)
  402. at org.apache.maven.surefire.junit4.JUnit4Provider.invoke(JUnit4Provider.java:124)
  403. at sun.reflect.NativeMethodAccessorImpl.invoke0(Native Method)
  404. at sun.reflect.NativeMethodAccessorImpl.invoke(NativeMethodAccessorImpl.java:57)
  405. at sun.reflect.DelegatingMethodAccessorImpl.invoke(DelegatingMethodAccessorImpl.java:43)
  406. at java.lang.reflect.Method.invoke(Method.java:606)
  407. at org.apache.maven.surefire.util.ReflectionUtils.invokeMethodWithArray2(ReflectionUtils.java:208)
  408. at org.apache.maven.surefire.booter.ProviderFactory$ProviderProxy.invoke(ProviderFactory.java:158)
  409. at org.apache.maven.surefire.booter.ProviderFactory.invokeProvider(ProviderFactory.java:86)
  410. at org.apache.maven.surefire.booter.ForkedBooter.runSuitesInProcess(ForkedBooter.java:153)
  411. at org.apache.maven.surefire.booter.ForkedBooter.main(ForkedBooter.java:95)
  412.  
  413. Running com.pcitc.common.repository.UserRepository2ImplForDefaultSearchIT
  414. Tests run: 1, Failures: 0, Errors: 1, Skipped: 0, Time elapsed: 0.001 sec <<< FAILURE!
  415. initializationError(com.pcitc.common.repository.UserRepository2ImplForDefaultSearchIT) Time elapsed: 0.001 sec <<< ERROR!
  416. java.lang.NoClassDefFoundError: org/springframework/core/annotation/AnnotatedElementUtils
  417. at org.springframework.test.context.MetaAnnotationUtils$AnnotationDescriptor.<init>(MetaAnnotationUtils.java:269)
  418. at org.springframework.test.context.MetaAnnotationUtils$AnnotationDescriptor.<init>(MetaAnnotationUtils.java:257)
  419. at org.springframework.test.context.MetaAnnotationUtils$UntypedAnnotationDescriptor.<init>(MetaAnnotationUtils.java:326)
  420. at org.springframework.test.context.MetaAnnotationUtils.findAnnotationDescriptorForTypes(MetaAnnotationUtils.java:171)
  421. at org.springframework.test.context.MetaAnnotationUtils.findAnnotationDescriptorForTypes(MetaAnnotationUtils.java:188)
  422. at org.springframework.test.context.MetaAnnotationUtils.findAnnotationDescriptorForTypes(MetaAnnotationUtils.java:188)
  423. at org.springframework.test.context.ContextLoaderUtils.buildMergedContextConfiguration(ContextLoaderUtils.java:621)
  424. at org.springframework.test.context.DefaultTestContext.<init>(DefaultTestContext.java:93)
  425. at org.springframework.test.context.TestContextManager.<init>(TestContextManager.java:119)
  426. at org.springframework.test.context.junit4.SpringJUnit4ClassRunner.createTestContextManager(SpringJUnit4ClassRunner.java:120)
  427. at org.springframework.test.context.junit4.SpringJUnit4ClassRunner.<init>(SpringJUnit4ClassRunner.java:109)
  428. at sun.reflect.NativeConstructorAccessorImpl.newInstance0(Native Method)
  429. at sun.reflect.NativeConstructorAccessorImpl.newInstance(NativeConstructorAccessorImpl.java:57)
  430. at sun.reflect.DelegatingConstructorAccessorImpl.newInstance(DelegatingConstructorAccessorImpl.java:45)
  431. at java.lang.reflect.Constructor.newInstance(Constructor.java:526)
  432. at org.junit.internal.builders.AnnotatedBuilder.buildRunner(AnnotatedBuilder.java:29)
  433. at org.junit.internal.builders.AnnotatedBuilder.runnerForClass(AnnotatedBuilder.java:21)
  434. at org.junit.runners.model.RunnerBuilder.safeRunnerForClass(RunnerBuilder.java:59)
  435. at org.junit.internal.builders.AllDefaultPossibilitiesBuilder.runnerForClass(AllDefaultPossibilitiesBuilder.java:26)
  436. at org.junit.runners.model.RunnerBuilder.safeRunnerForClass(RunnerBuilder.java:59)
  437. at org.junit.internal.requests.ClassRequest.getRunner(ClassRequest.java:26)
  438. at org.apache.maven.surefire.junit4.JUnit4Provider.execute(JUnit4Provider.java:262)
  439. at org.apache.maven.surefire.junit4.JUnit4Provider.executeTestSet(JUnit4Provider.java:153)
  440. at org.apache.maven.surefire.junit4.JUnit4Provider.invoke(JUnit4Provider.java:124)
  441. at sun.reflect.NativeMethodAccessorImpl.invoke0(Native Method)
  442. at sun.reflect.NativeMethodAccessorImpl.invoke(NativeMethodAccessorImpl.java:57)
  443. at sun.reflect.DelegatingMethodAccessorImpl.invoke(DelegatingMethodAccessorImpl.java:43)
  444. at java.lang.reflect.Method.invoke(Method.java:606)
  445. at org.apache.maven.surefire.util.ReflectionUtils.invokeMethodWithArray2(ReflectionUtils.java:208)
  446. at org.apache.maven.surefire.booter.ProviderFactory$ProviderProxy.invoke(ProviderFactory.java:158)
  447. at org.apache.maven.surefire.booter.ProviderFactory.invokeProvider(ProviderFactory.java:86)
  448. at org.apache.maven.surefire.booter.ForkedBooter.runSuitesInProcess(ForkedBooter.java:153)
  449. at org.apache.maven.surefire.booter.ForkedBooter.main(ForkedBooter.java:95)
  450.  
  451. Running com.pcitc.common.repository.UserRepository2ImplIT
  452. Tests run: 1, Failures: 0, Errors: 1, Skipped: 0, Time elapsed: 0 sec <<< FAILURE!
  453. initializationError(com.pcitc.common.repository.UserRepository2ImplIT) Time elapsed: 0 sec <<< ERROR!
  454. java.lang.NoClassDefFoundError: org/springframework/core/annotation/AnnotatedElementUtils
  455. at org.springframework.test.context.MetaAnnotationUtils$AnnotationDescriptor.<init>(MetaAnnotationUtils.java:269)
  456. at org.springframework.test.context.MetaAnnotationUtils$AnnotationDescriptor.<init>(MetaAnnotationUtils.java:257)
  457. at org.springframework.test.context.MetaAnnotationUtils$UntypedAnnotationDescriptor.<init>(MetaAnnotationUtils.java:326)
  458. at org.springframework.test.context.MetaAnnotationUtils.findAnnotationDescriptorForTypes(MetaAnnotationUtils.java:171)
  459. at org.springframework.test.context.MetaAnnotationUtils.findAnnotationDescriptorForTypes(MetaAnnotationUtils.java:188)
  460. at org.springframework.test.context.MetaAnnotationUtils.findAnnotationDescriptorForTypes(MetaAnnotationUtils.java:188)
  461. at org.springframework.test.context.ContextLoaderUtils.buildMergedContextConfiguration(ContextLoaderUtils.java:621)
  462. at org.springframework.test.context.DefaultTestContext.<init>(DefaultTestContext.java:93)
  463. at org.springframework.test.context.TestContextManager.<init>(TestContextManager.java:119)
  464. at org.springframework.test.context.junit4.SpringJUnit4ClassRunner.createTestContextManager(SpringJUnit4ClassRunner.java:120)
  465. at org.springframework.test.context.junit4.SpringJUnit4ClassRunner.<init>(SpringJUnit4ClassRunner.java:109)
  466. at sun.reflect.NativeConstructorAccessorImpl.newInstance0(Native Method)
  467. at sun.reflect.NativeConstructorAccessorImpl.newInstance(NativeConstructorAccessorImpl.java:57)
  468. at sun.reflect.DelegatingConstructorAccessorImpl.newInstance(DelegatingConstructorAccessorImpl.java:45)
  469. at java.lang.reflect.Constructor.newInstance(Constructor.java:526)
  470. at org.junit.internal.builders.AnnotatedBuilder.buildRunner(AnnotatedBuilder.java:29)
  471. at org.junit.internal.builders.AnnotatedBuilder.runnerForClass(AnnotatedBuilder.java:21)
  472. at org.junit.runners.model.RunnerBuilder.safeRunnerForClass(RunnerBuilder.java:59)
  473. at org.junit.internal.builders.AllDefaultPossibilitiesBuilder.runnerForClass(AllDefaultPossibilitiesBuilder.java:26)
  474. at org.junit.runners.model.RunnerBuilder.safeRunnerForClass(RunnerBuilder.java:59)
  475. at org.junit.internal.requests.ClassRequest.getRunner(ClassRequest.java:26)
  476. at org.apache.maven.surefire.junit4.JUnit4Provider.execute(JUnit4Provider.java:262)
  477. at org.apache.maven.surefire.junit4.JUnit4Provider.executeTestSet(JUnit4Provider.java:153)
  478. at org.apache.maven.surefire.junit4.JUnit4Provider.invoke(JUnit4Provider.java:124)
  479. at sun.reflect.NativeMethodAccessorImpl.invoke0(Native Method)
  480. at sun.reflect.NativeMethodAccessorImpl.invoke(NativeMethodAccessorImpl.java:57)
  481. at sun.reflect.DelegatingMethodAccessorImpl.invoke(DelegatingMethodAccessorImpl.java:43)
  482. at java.lang.reflect.Method.invoke(Method.java:606)
  483. at org.apache.maven.surefire.util.ReflectionUtils.invokeMethodWithArray2(ReflectionUtils.java:208)
  484. at org.apache.maven.surefire.booter.ProviderFactory$ProviderProxy.invoke(ProviderFactory.java:158)
  485. at org.apache.maven.surefire.booter.ProviderFactory.invokeProvider(ProviderFactory.java:86)
  486. at org.apache.maven.surefire.booter.ForkedBooter.runSuitesInProcess(ForkedBooter.java:153)
  487. at org.apache.maven.surefire.booter.ForkedBooter.main(ForkedBooter.java:95)
  488.  
  489. Running com.pcitc.common.service.UserServiceTest
  490. Tests run: 1, Failures: 0, Errors: 1, Skipped: 0, Time elapsed: 0 sec <<< FAILURE!
  491. initializationError(com.pcitc.common.service.UserServiceTest) Time elapsed: 0 sec <<< ERROR!
  492. java.lang.NoClassDefFoundError: org/springframework/core/annotation/AnnotatedElementUtils
  493. at org.springframework.test.context.MetaAnnotationUtils$AnnotationDescriptor.<init>(MetaAnnotationUtils.java:269)
  494. at org.springframework.test.context.MetaAnnotationUtils$AnnotationDescriptor.<init>(MetaAnnotationUtils.java:257)
  495. at org.springframework.test.context.MetaAnnotationUtils$UntypedAnnotationDescriptor.<init>(MetaAnnotationUtils.java:326)
  496. at org.springframework.test.context.MetaAnnotationUtils.findAnnotationDescriptorForTypes(MetaAnnotationUtils.java:171)
  497. at org.springframework.test.context.MetaAnnotationUtils.findAnnotationDescriptorForTypes(MetaAnnotationUtils.java:188)
  498. at org.springframework.test.context.MetaAnnotationUtils.findAnnotationDescriptorForTypes(MetaAnnotationUtils.java:188)
  499. at org.springframework.test.context.ContextLoaderUtils.buildMergedContextConfiguration(ContextLoaderUtils.java:621)
  500. at org.springframework.test.context.DefaultTestContext.<init>(DefaultTestContext.java:93)
  501. at org.springframework.test.context.TestContextManager.<init>(TestContextManager.java:119)
  502. at org.springframework.test.context.junit4.SpringJUnit4ClassRunner.createTestContextManager(SpringJUnit4ClassRunner.java:120)
  503. at org.springframework.test.context.junit4.SpringJUnit4ClassRunner.<init>(SpringJUnit4ClassRunner.java:109)
  504. at sun.reflect.NativeConstructorAccessorImpl.newInstance0(Native Method)
  505. at sun.reflect.NativeConstructorAccessorImpl.newInstance(NativeConstructorAccessorImpl.java:57)
  506. at sun.reflect.DelegatingConstructorAccessorImpl.newInstance(DelegatingConstructorAccessorImpl.java:45)
  507. at java.lang.reflect.Constructor.newInstance(Constructor.java:526)
  508. at org.junit.internal.builders.AnnotatedBuilder.buildRunner(AnnotatedBuilder.java:29)
  509. at org.junit.internal.builders.AnnotatedBuilder.runnerForClass(AnnotatedBuilder.java:21)
  510. at org.junit.runners.model.RunnerBuilder.safeRunnerForClass(RunnerBuilder.java:59)
  511. at org.junit.internal.builders.AllDefaultPossibilitiesBuilder.runnerForClass(AllDefaultPossibilitiesBuilder.java:26)
  512. at org.junit.runners.model.RunnerBuilder.safeRunnerForClass(RunnerBuilder.java:59)
  513. at org.junit.internal.requests.ClassRequest.getRunner(ClassRequest.java:26)
  514. at org.apache.maven.surefire.junit4.JUnit4Provider.execute(JUnit4Provider.java:262)
  515. at org.apache.maven.surefire.junit4.JUnit4Provider.executeTestSet(JUnit4Provider.java:153)
  516. at org.apache.maven.surefire.junit4.JUnit4Provider.invoke(JUnit4Provider.java:124)
  517. at sun.reflect.NativeMethodAccessorImpl.invoke0(Native Method)
  518. at sun.reflect.NativeMethodAccessorImpl.invoke(NativeMethodAccessorImpl.java:57)
  519. at sun.reflect.DelegatingMethodAccessorImpl.invoke(DelegatingMethodAccessorImpl.java:43)
  520. at java.lang.reflect.Method.invoke(Method.java:606)
  521. at org.apache.maven.surefire.util.ReflectionUtils.invokeMethodWithArray2(ReflectionUtils.java:208)
  522. at org.apache.maven.surefire.booter.ProviderFactory$ProviderProxy.invoke(ProviderFactory.java:158)
  523. at org.apache.maven.surefire.booter.ProviderFactory.invokeProvider(ProviderFactory.java:86)
  524. at org.apache.maven.surefire.booter.ForkedBooter.runSuitesInProcess(ForkedBooter.java:153)
  525. at org.apache.maven.surefire.booter.ForkedBooter.main(ForkedBooter.java:95)
  526.  
  527. Running com.pcitc.common.service.UserServiceWithRespository2ImplTest
  528. Tests run: 1, Failures: 0, Errors: 1, Skipped: 0, Time elapsed: 0.001 sec <<< FAILURE!
  529. initializationError(com.pcitc.common.service.UserServiceWithRespository2ImplTest) Time elapsed: 0.001 sec <<< ERROR!
  530. java.lang.NoClassDefFoundError: org/springframework/core/annotation/AnnotatedElementUtils
  531. at org.springframework.test.context.MetaAnnotationUtils$AnnotationDescriptor.<init>(MetaAnnotationUtils.java:269)
  532. at org.springframework.test.context.MetaAnnotationUtils$AnnotationDescriptor.<init>(MetaAnnotationUtils.java:257)
  533. at org.springframework.test.context.MetaAnnotationUtils$UntypedAnnotationDescriptor.<init>(MetaAnnotationUtils.java:326)
  534. at org.springframework.test.context.MetaAnnotationUtils.findAnnotationDescriptorForTypes(MetaAnnotationUtils.java:171)
  535. at org.springframework.test.context.MetaAnnotationUtils.findAnnotationDescriptorForTypes(MetaAnnotationUtils.java:188)
  536. at org.springframework.test.context.MetaAnnotationUtils.findAnnotationDescriptorForTypes(MetaAnnotationUtils.java:188)
  537. at org.springframework.test.context.MetaAnnotationUtils.findAnnotationDescriptorForTypes(MetaAnnotationUtils.java:188)
  538. at org.springframework.test.context.ContextLoaderUtils.buildMergedContextConfiguration(ContextLoaderUtils.java:621)
  539. at org.springframework.test.context.DefaultTestContext.<init>(DefaultTestContext.java:93)
  540. at org.springframework.test.context.TestContextManager.<init>(TestContextManager.java:119)
  541. at org.springframework.test.context.junit4.SpringJUnit4ClassRunner.createTestContextManager(SpringJUnit4ClassRunner.java:120)
  542. at org.springframework.test.context.junit4.SpringJUnit4ClassRunner.<init>(SpringJUnit4ClassRunner.java:109)
  543. at sun.reflect.NativeConstructorAccessorImpl.newInstance0(Native Method)
  544. at sun.reflect.NativeConstructorAccessorImpl.newInstance(NativeConstructorAccessorImpl.java:57)
  545. at sun.reflect.DelegatingConstructorAccessorImpl.newInstance(DelegatingConstructorAccessorImpl.java:45)
  546. at java.lang.reflect.Constructor.newInstance(Constructor.java:526)
  547. at org.junit.internal.builders.AnnotatedBuilder.buildRunner(AnnotatedBuilder.java:29)
  548. at org.junit.internal.builders.AnnotatedBuilder.runnerForClass(AnnotatedBuilder.java:21)
  549. at org.junit.runners.model.RunnerBuilder.safeRunnerForClass(RunnerBuilder.java:59)
  550. at org.junit.internal.builders.AllDefaultPossibilitiesBuilder.runnerForClass(AllDefaultPossibilitiesBuilder.java:26)
  551. at org.junit.runners.model.RunnerBuilder.safeRunnerForClass(RunnerBuilder.java:59)
  552. at org.junit.internal.requests.ClassRequest.getRunner(ClassRequest.java:26)
  553. at org.apache.maven.surefire.junit4.JUnit4Provider.execute(JUnit4Provider.java:262)
  554. at org.apache.maven.surefire.junit4.JUnit4Provider.executeTestSet(JUnit4Provider.java:153)
  555. at org.apache.maven.surefire.junit4.JUnit4Provider.invoke(JUnit4Provider.java:124)
  556. at sun.reflect.NativeMethodAccessorImpl.invoke0(Native Method)
  557. at sun.reflect.NativeMethodAccessorImpl.invoke(NativeMethodAccessorImpl.java:57)
  558. at sun.reflect.DelegatingMethodAccessorImpl.invoke(DelegatingMethodAccessorImpl.java:43)
  559. at java.lang.reflect.Method.invoke(Method.java:606)
  560. at org.apache.maven.surefire.util.ReflectionUtils.invokeMethodWithArray2(ReflectionUtils.java:208)
  561. at org.apache.maven.surefire.booter.ProviderFactory$ProviderProxy.invoke(ProviderFactory.java:158)
  562. at org.apache.maven.surefire.booter.ProviderFactory.invokeProvider(ProviderFactory.java:86)
  563. at org.apache.maven.surefire.booter.ForkedBooter.runSuitesInProcess(ForkedBooter.java:153)
  564. at org.apache.maven.surefire.booter.ForkedBooter.main(ForkedBooter.java:95)
  565.  
  566. Running com.pcitc.common.utils.forbidden.ForbiddenWordUtilsTest
  567. Tests run: 7, Failures: 0, Errors: 0, Skipped: 1, Time elapsed: 0.001 sec
  568. Running com.pcitc.common.utils.html.HtmlUtilsTest
  569. Tests run: 4, Failures: 0, Errors: 0, Skipped: 0, Time elapsed: 0.001 sec
  570. Running com.pcitc.common.web.bind.method.annotation.PageableMethodArgumentResolverTest
  571. Tests run: 8, Failures: 0, Errors: 0, Skipped: 0, Time elapsed: 0 sec
  572. Running com.pcitc.common.web.bind.method.annotation.SearchableMethodArgumentResolverTest
  573. Tests run: 9, Failures: 0, Errors: 0, Skipped: 0, Time elapsed: 0.001 sec
  574. Running com.pcitc.maintain.notification.service.NotificationApiIT
  575. Tests run: 1, Failures: 0, Errors: 1, Skipped: 0, Time elapsed: 0 sec <<< FAILURE!
  576. initializationError(com.pcitc.maintain.notification.service.NotificationApiIT) Time elapsed: 0 sec <<< ERROR!
  577. java.lang.NoClassDefFoundError: org/springframework/core/annotation/AnnotatedElementUtils
  578. at org.springframework.test.context.MetaAnnotationUtils$AnnotationDescriptor.<init>(MetaAnnotationUtils.java:269)
  579. at org.springframework.test.context.MetaAnnotationUtils$AnnotationDescriptor.<init>(MetaAnnotationUtils.java:257)
  580. at org.springframework.test.context.MetaAnnotationUtils$UntypedAnnotationDescriptor.<init>(MetaAnnotationUtils.java:326)
  581. at org.springframework.test.context.MetaAnnotationUtils.findAnnotationDescriptorForTypes(MetaAnnotationUtils.java:171)
  582. at org.springframework.test.context.MetaAnnotationUtils.findAnnotationDescriptorForTypes(MetaAnnotationUtils.java:188)
  583. at org.springframework.test.context.MetaAnnotationUtils.findAnnotationDescriptorForTypes(MetaAnnotationUtils.java:188)
  584. at org.springframework.test.context.ContextLoaderUtils.buildMergedContextConfiguration(ContextLoaderUtils.java:621)
  585. at org.springframework.test.context.DefaultTestContext.<init>(DefaultTestContext.java:93)
  586. at org.springframework.test.context.TestContextManager.<init>(TestContextManager.java:119)
  587. at org.springframework.test.context.junit4.SpringJUnit4ClassRunner.createTestContextManager(SpringJUnit4ClassRunner.java:120)
  588. at org.springframework.test.context.junit4.SpringJUnit4ClassRunner.<init>(SpringJUnit4ClassRunner.java:109)
  589. at sun.reflect.NativeConstructorAccessorImpl.newInstance0(Native Method)
  590. at sun.reflect.NativeConstructorAccessorImpl.newInstance(NativeConstructorAccessorImpl.java:57)
  591. at sun.reflect.DelegatingConstructorAccessorImpl.newInstance(DelegatingConstructorAccessorImpl.java:45)
  592. at java.lang.reflect.Constructor.newInstance(Constructor.java:526)
  593. at org.junit.internal.builders.AnnotatedBuilder.buildRunner(AnnotatedBuilder.java:29)
  594. at org.junit.internal.builders.AnnotatedBuilder.runnerForClass(AnnotatedBuilder.java:21)
  595. at org.junit.runners.model.RunnerBuilder.safeRunnerForClass(RunnerBuilder.java:59)
  596. at org.junit.internal.builders.AllDefaultPossibilitiesBuilder.runnerForClass(AllDefaultPossibilitiesBuilder.java:26)
  597. at org.junit.runners.model.RunnerBuilder.safeRunnerForClass(RunnerBuilder.java:59)
  598. at org.junit.internal.requests.ClassRequest.getRunner(ClassRequest.java:26)
  599. at org.apache.maven.surefire.junit4.JUnit4Provider.execute(JUnit4Provider.java:262)
  600. at org.apache.maven.surefire.junit4.JUnit4Provider.executeTestSet(JUnit4Provider.java:153)
  601. at org.apache.maven.surefire.junit4.JUnit4Provider.invoke(JUnit4Provider.java:124)
  602. at sun.reflect.NativeMethodAccessorImpl.invoke0(Native Method)
  603. at sun.reflect.NativeMethodAccessorImpl.invoke(NativeMethodAccessorImpl.java:57)
  604. at sun.reflect.DelegatingMethodAccessorImpl.invoke(DelegatingMethodAccessorImpl.java:43)
  605. at java.lang.reflect.Method.invoke(Method.java:606)
  606. at org.apache.maven.surefire.util.ReflectionUtils.invokeMethodWithArray2(ReflectionUtils.java:208)
  607. at org.apache.maven.surefire.booter.ProviderFactory$ProviderProxy.invoke(ProviderFactory.java:158)
  608. at org.apache.maven.surefire.booter.ProviderFactory.invokeProvider(ProviderFactory.java:86)
  609. at org.apache.maven.surefire.booter.ForkedBooter.runSuitesInProcess(ForkedBooter.java:153)
  610. at org.apache.maven.surefire.booter.ForkedBooter.main(ForkedBooter.java:95)
  611.  
  612. Running com.pcitc.personal.message.service.MessageApiIT
  613. Tests run: 1, Failures: 0, Errors: 1, Skipped: 0, Time elapsed: 0 sec <<< FAILURE!
  614. initializationError(com.pcitc.personal.message.service.MessageApiIT) Time elapsed: 0 sec <<< ERROR!
  615. java.lang.NoClassDefFoundError: org/springframework/core/annotation/AnnotatedElementUtils
  616. at org.springframework.test.context.MetaAnnotationUtils$AnnotationDescriptor.<init>(MetaAnnotationUtils.java:269)
  617. at org.springframework.test.context.MetaAnnotationUtils$AnnotationDescriptor.<init>(MetaAnnotationUtils.java:257)
  618. at org.springframework.test.context.MetaAnnotationUtils$UntypedAnnotationDescriptor.<init>(MetaAnnotationUtils.java:326)
  619. at org.springframework.test.context.MetaAnnotationUtils.findAnnotationDescriptorForTypes(MetaAnnotationUtils.java:171)
  620. at org.springframework.test.context.MetaAnnotationUtils.findAnnotationDescriptorForTypes(MetaAnnotationUtils.java:188)
  621. at org.springframework.test.context.MetaAnnotationUtils.findAnnotationDescriptorForTypes(MetaAnnotationUtils.java:188)
  622. at org.springframework.test.context.MetaAnnotationUtils.findAnnotationDescriptorForTypes(MetaAnnotationUtils.java:188)
  623. at org.springframework.test.context.ContextLoaderUtils.buildMergedContextConfiguration(ContextLoaderUtils.java:621)
  624. at org.springframework.test.context.DefaultTestContext.<init>(DefaultTestContext.java:93)
  625. at org.springframework.test.context.TestContextManager.<init>(TestContextManager.java:119)
  626. at org.springframework.test.context.junit4.SpringJUnit4ClassRunner.createTestContextManager(SpringJUnit4ClassRunner.java:120)
  627. at org.springframework.test.context.junit4.SpringJUnit4ClassRunner.<init>(SpringJUnit4ClassRunner.java:109)
  628. at sun.reflect.NativeConstructorAccessorImpl.newInstance0(Native Method)
  629. at sun.reflect.NativeConstructorAccessorImpl.newInstance(NativeConstructorAccessorImpl.java:57)
  630. at sun.reflect.DelegatingConstructorAccessorImpl.newInstance(DelegatingConstructorAccessorImpl.java:45)
  631. at java.lang.reflect.Constructor.newInstance(Constructor.java:526)
  632. at org.junit.internal.builders.AnnotatedBuilder.buildRunner(AnnotatedBuilder.java:29)
  633. at org.junit.internal.builders.AnnotatedBuilder.runnerForClass(AnnotatedBuilder.java:21)
  634. at org.junit.runners.model.RunnerBuilder.safeRunnerForClass(RunnerBuilder.java:59)
  635. at org.junit.internal.builders.AllDefaultPossibilitiesBuilder.runnerForClass(AllDefaultPossibilitiesBuilder.java:26)
  636. at org.junit.runners.model.RunnerBuilder.safeRunnerForClass(RunnerBuilder.java:59)
  637. at org.junit.internal.requests.ClassRequest.getRunner(ClassRequest.java:26)
  638. at org.apache.maven.surefire.junit4.JUnit4Provider.execute(JUnit4Provider.java:262)
  639. at org.apache.maven.surefire.junit4.JUnit4Provider.executeTestSet(JUnit4Provider.java:153)
  640. at org.apache.maven.surefire.junit4.JUnit4Provider.invoke(JUnit4Provider.java:124)
  641. at sun.reflect.NativeMethodAccessorImpl.invoke0(Native Method)
  642. at sun.reflect.NativeMethodAccessorImpl.invoke(NativeMethodAccessorImpl.java:57)
  643. at sun.reflect.DelegatingMethodAccessorImpl.invoke(DelegatingMethodAccessorImpl.java:43)
  644. at java.lang.reflect.Method.invoke(Method.java:606)
  645. at org.apache.maven.surefire.util.ReflectionUtils.invokeMethodWithArray2(ReflectionUtils.java:208)
  646. at org.apache.maven.surefire.booter.ProviderFactory$ProviderProxy.invoke(ProviderFactory.java:158)
  647. at org.apache.maven.surefire.booter.ProviderFactory.invokeProvider(ProviderFactory.java:86)
  648. at org.apache.maven.surefire.booter.ForkedBooter.runSuitesInProcess(ForkedBooter.java:153)
  649. at org.apache.maven.surefire.booter.ForkedBooter.main(ForkedBooter.java:95)
  650.  
  651. Running com.pcitc.personal.message.task.MessageClearTaskIT
  652. Tests run: 1, Failures: 0, Errors: 1, Skipped: 0, Time elapsed: 0 sec <<< FAILURE!
  653. initializationError(com.pcitc.personal.message.task.MessageClearTaskIT) Time elapsed: 0 sec <<< ERROR!
  654. java.lang.NoClassDefFoundError: org/springframework/core/annotation/AnnotatedElementUtils
  655. at org.springframework.test.context.MetaAnnotationUtils$AnnotationDescriptor.<init>(MetaAnnotationUtils.java:269)
  656. at org.springframework.test.context.MetaAnnotationUtils$AnnotationDescriptor.<init>(MetaAnnotationUtils.java:257)
  657. at org.springframework.test.context.MetaAnnotationUtils$UntypedAnnotationDescriptor.<init>(MetaAnnotationUtils.java:326)
  658. at org.springframework.test.context.MetaAnnotationUtils.findAnnotationDescriptorForTypes(MetaAnnotationUtils.java:171)
  659. at org.springframework.test.context.MetaAnnotationUtils.findAnnotationDescriptorForTypes(MetaAnnotationUtils.java:188)
  660. at org.springframework.test.context.MetaAnnotationUtils.findAnnotationDescriptorForTypes(MetaAnnotationUtils.java:188)
  661. at org.springframework.test.context.MetaAnnotationUtils.findAnnotationDescriptorForTypes(MetaAnnotationUtils.java:188)
  662. at org.springframework.test.context.ContextLoaderUtils.buildMergedContextConfiguration(ContextLoaderUtils.java:621)
  663. at org.springframework.test.context.DefaultTestContext.<init>(DefaultTestContext.java:93)
  664. at org.springframework.test.context.TestContextManager.<init>(TestContextManager.java:119)
  665. at org.springframework.test.context.junit4.SpringJUnit4ClassRunner.createTestContextManager(SpringJUnit4ClassRunner.java:120)
  666. at org.springframework.test.context.junit4.SpringJUnit4ClassRunner.<init>(SpringJUnit4ClassRunner.java:109)
  667. at sun.reflect.NativeConstructorAccessorImpl.newInstance0(Native Method)
  668. at sun.reflect.NativeConstructorAccessorImpl.newInstance(NativeConstructorAccessorImpl.java:57)
  669. at sun.reflect.DelegatingConstructorAccessorImpl.newInstance(DelegatingConstructorAccessorImpl.java:45)
  670. at java.lang.reflect.Constructor.newInstance(Constructor.java:526)
  671. at org.junit.internal.builders.AnnotatedBuilder.buildRunner(AnnotatedBuilder.java:29)
  672. at org.junit.internal.builders.AnnotatedBuilder.runnerForClass(AnnotatedBuilder.java:21)
  673. at org.junit.runners.model.RunnerBuilder.safeRunnerForClass(RunnerBuilder.java:59)
  674. at org.junit.internal.builders.AllDefaultPossibilitiesBuilder.runnerForClass(AllDefaultPossibilitiesBuilder.java:26)
  675. at org.junit.runners.model.RunnerBuilder.safeRunnerForClass(RunnerBuilder.java:59)
  676. at org.junit.internal.requests.ClassRequest.getRunner(ClassRequest.java:26)
  677. at org.apache.maven.surefire.junit4.JUnit4Provider.execute(JUnit4Provider.java:262)
  678. at org.apache.maven.surefire.junit4.JUnit4Provider.executeTestSet(JUnit4Provider.java:153)
  679. at org.apache.maven.surefire.junit4.JUnit4Provider.invoke(JUnit4Provider.java:124)
  680. at sun.reflect.NativeMethodAccessorImpl.invoke0(Native Method)
  681. at sun.reflect.NativeMethodAccessorImpl.invoke(NativeMethodAccessorImpl.java:57)
  682. at sun.reflect.DelegatingMethodAccessorImpl.invoke(DelegatingMethodAccessorImpl.java:43)
  683. at java.lang.reflect.Method.invoke(Method.java:606)
  684. at org.apache.maven.surefire.util.ReflectionUtils.invokeMethodWithArray2(ReflectionUtils.java:208)
  685. at org.apache.maven.surefire.booter.ProviderFactory$ProviderProxy.invoke(ProviderFactory.java:158)
  686. at org.apache.maven.surefire.booter.ProviderFactory.invokeProvider(ProviderFactory.java:86)
  687. at org.apache.maven.surefire.booter.ForkedBooter.runSuitesInProcess(ForkedBooter.java:153)
  688. at org.apache.maven.surefire.booter.ForkedBooter.main(ForkedBooter.java:95)
  689.  
  690. Running com.pcitc.sys.auth.service.UserAuthServiceIT
  691. Tests run: 1, Failures: 0, Errors: 1, Skipped: 0, Time elapsed: 0.001 sec <<< FAILURE!
  692. initializationError(com.pcitc.sys.auth.service.UserAuthServiceIT) Time elapsed: 0 sec <<< ERROR!
  693. java.lang.NoClassDefFoundError: org/springframework/core/annotation/AnnotatedElementUtils
  694. at org.springframework.test.context.MetaAnnotationUtils$AnnotationDescriptor.<init>(MetaAnnotationUtils.java:269)
  695. at org.springframework.test.context.MetaAnnotationUtils$AnnotationDescriptor.<init>(MetaAnnotationUtils.java:257)
  696. at org.springframework.test.context.MetaAnnotationUtils$UntypedAnnotationDescriptor.<init>(MetaAnnotationUtils.java:326)
  697. at org.springframework.test.context.MetaAnnotationUtils.findAnnotationDescriptorForTypes(MetaAnnotationUtils.java:171)
  698. at org.springframework.test.context.MetaAnnotationUtils.findAnnotationDescriptorForTypes(MetaAnnotationUtils.java:188)
  699. at org.springframework.test.context.ContextLoaderUtils.buildMergedContextConfiguration(ContextLoaderUtils.java:621)
  700. at org.springframework.test.context.DefaultTestContext.<init>(DefaultTestContext.java:93)
  701. at org.springframework.test.context.TestContextManager.<init>(TestContextManager.java:119)
  702. at org.springframework.test.context.junit4.SpringJUnit4ClassRunner.createTestContextManager(SpringJUnit4ClassRunner.java:120)
  703. at org.springframework.test.context.junit4.SpringJUnit4ClassRunner.<init>(SpringJUnit4ClassRunner.java:109)
  704. at sun.reflect.GeneratedConstructorAccessor5.newInstance(Unknown Source)
  705. at sun.reflect.DelegatingConstructorAccessorImpl.newInstance(DelegatingConstructorAccessorImpl.java:45)
  706. at java.lang.reflect.Constructor.newInstance(Constructor.java:526)
  707. at org.junit.internal.builders.AnnotatedBuilder.buildRunner(AnnotatedBuilder.java:29)
  708. at org.junit.internal.builders.AnnotatedBuilder.runnerForClass(AnnotatedBuilder.java:21)
  709. at org.junit.runners.model.RunnerBuilder.safeRunnerForClass(RunnerBuilder.java:59)
  710. at org.junit.internal.builders.AllDefaultPossibilitiesBuilder.runnerForClass(AllDefaultPossibilitiesBuilder.java:26)
  711. at org.junit.runners.model.RunnerBuilder.safeRunnerForClass(RunnerBuilder.java:59)
  712. at org.junit.internal.requests.ClassRequest.getRunner(ClassRequest.java:26)
  713. at org.apache.maven.surefire.junit4.JUnit4Provider.execute(JUnit4Provider.java:262)
  714. at org.apache.maven.surefire.junit4.JUnit4Provider.executeTestSet(JUnit4Provider.java:153)
  715. at org.apache.maven.surefire.junit4.JUnit4Provider.invoke(JUnit4Provider.java:124)
  716. at sun.reflect.NativeMethodAccessorImpl.invoke0(Native Method)
  717. at sun.reflect.NativeMethodAccessorImpl.invoke(NativeMethodAccessorImpl.java:57)
  718. at sun.reflect.DelegatingMethodAccessorImpl.invoke(DelegatingMethodAccessorImpl.java:43)
  719. at java.lang.reflect.Method.invoke(Method.java:606)
  720. at org.apache.maven.surefire.util.ReflectionUtils.invokeMethodWithArray2(ReflectionUtils.java:208)
  721. at org.apache.maven.surefire.booter.ProviderFactory$ProviderProxy.invoke(ProviderFactory.java:158)
  722. at org.apache.maven.surefire.booter.ProviderFactory.invokeProvider(ProviderFactory.java:86)
  723. at org.apache.maven.surefire.booter.ForkedBooter.runSuitesInProcess(ForkedBooter.java:153)
  724. at org.apache.maven.surefire.booter.ForkedBooter.main(ForkedBooter.java:95)
  725.  
  726. Running com.pcitc.sys.auth.task.AuthRelationClearTaskIT
  727. Tests run: 1, Failures: 0, Errors: 1, Skipped: 0, Time elapsed: 0 sec <<< FAILURE!
  728. initializationError(com.pcitc.sys.auth.task.AuthRelationClearTaskIT) Time elapsed: 0 sec <<< ERROR!
  729. java.lang.NoClassDefFoundError: org/springframework/core/annotation/AnnotatedElementUtils
  730. at org.springframework.test.context.MetaAnnotationUtils$AnnotationDescriptor.<init>(MetaAnnotationUtils.java:269)
  731. at org.springframework.test.context.MetaAnnotationUtils$AnnotationDescriptor.<init>(MetaAnnotationUtils.java:257)
  732. at org.springframework.test.context.MetaAnnotationUtils$UntypedAnnotationDescriptor.<init>(MetaAnnotationUtils.java:326)
  733. at org.springframework.test.context.MetaAnnotationUtils.findAnnotationDescriptorForTypes(MetaAnnotationUtils.java:171)
  734. at org.springframework.test.context.MetaAnnotationUtils.findAnnotationDescriptorForTypes(MetaAnnotationUtils.java:188)
  735. at org.springframework.test.context.ContextLoaderUtils.buildMergedContextConfiguration(ContextLoaderUtils.java:621)
  736. at org.springframework.test.context.DefaultTestContext.<init>(DefaultTestContext.java:93)
  737. at org.springframework.test.context.TestContextManager.<init>(TestContextManager.java:119)
  738. at org.springframework.test.context.junit4.SpringJUnit4ClassRunner.createTestContextManager(SpringJUnit4ClassRunner.java:120)
  739. at org.springframework.test.context.junit4.SpringJUnit4ClassRunner.<init>(SpringJUnit4ClassRunner.java:109)
  740. at sun.reflect.GeneratedConstructorAccessor5.newInstance(Unknown Source)
  741. at sun.reflect.DelegatingConstructorAccessorImpl.newInstance(DelegatingConstructorAccessorImpl.java:45)
  742. at java.lang.reflect.Constructor.newInstance(Constructor.java:526)
  743. at org.junit.internal.builders.AnnotatedBuilder.buildRunner(AnnotatedBuilder.java:29)
  744. at org.junit.internal.builders.AnnotatedBuilder.runnerForClass(AnnotatedBuilder.java:21)
  745. at org.junit.runners.model.RunnerBuilder.safeRunnerForClass(RunnerBuilder.java:59)
  746. at org.junit.internal.builders.AllDefaultPossibilitiesBuilder.runnerForClass(AllDefaultPossibilitiesBuilder.java:26)
  747. at org.junit.runners.model.RunnerBuilder.safeRunnerForClass(RunnerBuilder.java:59)
  748. at org.junit.internal.requests.ClassRequest.getRunner(ClassRequest.java:26)
  749. at org.apache.maven.surefire.junit4.JUnit4Provider.execute(JUnit4Provider.java:262)
  750. at org.apache.maven.surefire.junit4.JUnit4Provider.executeTestSet(JUnit4Provider.java:153)
  751. at org.apache.maven.surefire.junit4.JUnit4Provider.invoke(JUnit4Provider.java:124)
  752. at sun.reflect.NativeMethodAccessorImpl.invoke0(Native Method)
  753. at sun.reflect.NativeMethodAccessorImpl.invoke(NativeMethodAccessorImpl.java:57)
  754. at sun.reflect.DelegatingMethodAccessorImpl.invoke(DelegatingMethodAccessorImpl.java:43)
  755. at java.lang.reflect.Method.invoke(Method.java:606)
  756. at org.apache.maven.surefire.util.ReflectionUtils.invokeMethodWithArray2(ReflectionUtils.java:208)
  757. at org.apache.maven.surefire.booter.ProviderFactory$ProviderProxy.invoke(ProviderFactory.java:158)
  758. at org.apache.maven.surefire.booter.ProviderFactory.invokeProvider(ProviderFactory.java:86)
  759. at org.apache.maven.surefire.booter.ForkedBooter.runSuitesInProcess(ForkedBooter.java:153)
  760. at org.apache.maven.surefire.booter.ForkedBooter.main(ForkedBooter.java:95)
  761.  
  762. Running com.pcitc.sys.group.task.GroupClearRelationTaskIT
  763. Tests run: 1, Failures: 0, Errors: 1, Skipped: 0, Time elapsed: 0 sec <<< FAILURE!
  764. initializationError(com.pcitc.sys.group.task.GroupClearRelationTaskIT) Time elapsed: 0 sec <<< ERROR!
  765. java.lang.NoClassDefFoundError: org/springframework/core/annotation/AnnotatedElementUtils
  766. at org.springframework.test.context.MetaAnnotationUtils$AnnotationDescriptor.<init>(MetaAnnotationUtils.java:269)
  767. at org.springframework.test.context.MetaAnnotationUtils$AnnotationDescriptor.<init>(MetaAnnotationUtils.java:257)
  768. at org.springframework.test.context.MetaAnnotationUtils$UntypedAnnotationDescriptor.<init>(MetaAnnotationUtils.java:326)
  769. at org.springframework.test.context.MetaAnnotationUtils.findAnnotationDescriptorForTypes(MetaAnnotationUtils.java:171)
  770. at org.springframework.test.context.MetaAnnotationUtils.findAnnotationDescriptorForTypes(MetaAnnotationUtils.java:188)
  771. at org.springframework.test.context.ContextLoaderUtils.buildMergedContextConfiguration(ContextLoaderUtils.java:621)
  772. at org.springframework.test.context.DefaultTestContext.<init>(DefaultTestContext.java:93)
  773. at org.springframework.test.context.TestContextManager.<init>(TestContextManager.java:119)
  774. at org.springframework.test.context.junit4.SpringJUnit4ClassRunner.createTestContextManager(SpringJUnit4ClassRunner.java:120)
  775. at org.springframework.test.context.junit4.SpringJUnit4ClassRunner.<init>(SpringJUnit4ClassRunner.java:109)
  776. at sun.reflect.GeneratedConstructorAccessor5.newInstance(Unknown Source)
  777. at sun.reflect.DelegatingConstructorAccessorImpl.newInstance(DelegatingConstructorAccessorImpl.java:45)
  778. at java.lang.reflect.Constructor.newInstance(Constructor.java:526)
  779. at org.junit.internal.builders.AnnotatedBuilder.buildRunner(AnnotatedBuilder.java:29)
  780. at org.junit.internal.builders.AnnotatedBuilder.runnerForClass(AnnotatedBuilder.java:21)
  781. at org.junit.runners.model.RunnerBuilder.safeRunnerForClass(RunnerBuilder.java:59)
  782. at org.junit.internal.builders.AllDefaultPossibilitiesBuilder.runnerForClass(AllDefaultPossibilitiesBuilder.java:26)
  783. at org.junit.runners.model.RunnerBuilder.safeRunnerForClass(RunnerBuilder.java:59)
  784. at org.junit.internal.requests.ClassRequest.getRunner(ClassRequest.java:26)
  785. at org.apache.maven.surefire.junit4.JUnit4Provider.execute(JUnit4Provider.java:262)
  786. at org.apache.maven.surefire.junit4.JUnit4Provider.executeTestSet(JUnit4Provider.java:153)
  787. at org.apache.maven.surefire.junit4.JUnit4Provider.invoke(JUnit4Provider.java:124)
  788. at sun.reflect.NativeMethodAccessorImpl.invoke0(Native Method)
  789. at sun.reflect.NativeMethodAccessorImpl.invoke(NativeMethodAccessorImpl.java:57)
  790. at sun.reflect.DelegatingMethodAccessorImpl.invoke(DelegatingMethodAccessorImpl.java:43)
  791. at java.lang.reflect.Method.invoke(Method.java:606)
  792. at org.apache.maven.surefire.util.ReflectionUtils.invokeMethodWithArray2(ReflectionUtils.java:208)
  793. at org.apache.maven.surefire.booter.ProviderFactory$ProviderProxy.invoke(ProviderFactory.java:158)
  794. at org.apache.maven.surefire.booter.ProviderFactory.invokeProvider(ProviderFactory.java:86)
  795. at org.apache.maven.surefire.booter.ForkedBooter.runSuitesInProcess(ForkedBooter.java:153)
  796. at org.apache.maven.surefire.booter.ForkedBooter.main(ForkedBooter.java:95)
  797.  
  798. Running com.pcitc.sys.role.service.RoleResourcePermissionIT
  799. Tests run: 1, Failures: 0, Errors: 1, Skipped: 0, Time elapsed: 0 sec <<< FAILURE!
  800. initializationError(com.pcitc.sys.role.service.RoleResourcePermissionIT) Time elapsed: 0 sec <<< ERROR!
  801. java.lang.NoClassDefFoundError: org/springframework/core/annotation/AnnotatedElementUtils
  802. at org.springframework.test.context.MetaAnnotationUtils$AnnotationDescriptor.<init>(MetaAnnotationUtils.java:269)
  803. at org.springframework.test.context.MetaAnnotationUtils$AnnotationDescriptor.<init>(MetaAnnotationUtils.java:257)
  804. at org.springframework.test.context.MetaAnnotationUtils$UntypedAnnotationDescriptor.<init>(MetaAnnotationUtils.java:326)
  805. at org.springframework.test.context.MetaAnnotationUtils.findAnnotationDescriptorForTypes(MetaAnnotationUtils.java:171)
  806. at org.springframework.test.context.MetaAnnotationUtils.findAnnotationDescriptorForTypes(MetaAnnotationUtils.java:188)
  807. at org.springframework.test.context.ContextLoaderUtils.buildMergedContextConfiguration(ContextLoaderUtils.java:621)
  808. at org.springframework.test.context.DefaultTestContext.<init>(DefaultTestContext.java:93)
  809. at org.springframework.test.context.TestContextManager.<init>(TestContextManager.java:119)
  810. at org.springframework.test.context.junit4.SpringJUnit4ClassRunner.createTestContextManager(SpringJUnit4ClassRunner.java:120)
  811. at org.springframework.test.context.junit4.SpringJUnit4ClassRunner.<init>(SpringJUnit4ClassRunner.java:109)
  812. at sun.reflect.GeneratedConstructorAccessor5.newInstance(Unknown Source)
  813. at sun.reflect.DelegatingConstructorAccessorImpl.newInstance(DelegatingConstructorAccessorImpl.java:45)
  814. at java.lang.reflect.Constructor.newInstance(Constructor.java:526)
  815. at org.junit.internal.builders.AnnotatedBuilder.buildRunner(AnnotatedBuilder.java:29)
  816. at org.junit.internal.builders.AnnotatedBuilder.runnerForClass(AnnotatedBuilder.java:21)
  817. at org.junit.runners.model.RunnerBuilder.safeRunnerForClass(RunnerBuilder.java:59)
  818. at org.junit.internal.builders.AllDefaultPossibilitiesBuilder.runnerForClass(AllDefaultPossibilitiesBuilder.java:26)
  819. at org.junit.runners.model.RunnerBuilder.safeRunnerForClass(RunnerBuilder.java:59)
  820. at org.junit.internal.requests.ClassRequest.getRunner(ClassRequest.java:26)
  821. at org.apache.maven.surefire.junit4.JUnit4Provider.execute(JUnit4Provider.java:262)
  822. at org.apache.maven.surefire.junit4.JUnit4Provider.executeTestSet(JUnit4Provider.java:153)
  823. at org.apache.maven.surefire.junit4.JUnit4Provider.invoke(JUnit4Provider.java:124)
  824. at sun.reflect.NativeMethodAccessorImpl.invoke0(Native Method)
  825. at sun.reflect.NativeMethodAccessorImpl.invoke(NativeMethodAccessorImpl.java:57)
  826. at sun.reflect.DelegatingMethodAccessorImpl.invoke(DelegatingMethodAccessorImpl.java:43)
  827. at java.lang.reflect.Method.invoke(Method.java:606)
  828. at org.apache.maven.surefire.util.ReflectionUtils.invokeMethodWithArray2(ReflectionUtils.java:208)
  829. at org.apache.maven.surefire.booter.ProviderFactory$ProviderProxy.invoke(ProviderFactory.java:158)
  830. at org.apache.maven.surefire.booter.ProviderFactory.invokeProvider(ProviderFactory.java:86)
  831. at org.apache.maven.surefire.booter.ForkedBooter.runSuitesInProcess(ForkedBooter.java:153)
  832. at org.apache.maven.surefire.booter.ForkedBooter.main(ForkedBooter.java:95)
  833.  
  834. Running com.pcitc.sys.role.task.RoleClearRelationTaskIT
  835. Tests run: 1, Failures: 0, Errors: 1, Skipped: 0, Time elapsed: 0 sec <<< FAILURE!
  836. initializationError(com.pcitc.sys.role.task.RoleClearRelationTaskIT) Time elapsed: 0 sec <<< ERROR!
  837. java.lang.NoClassDefFoundError: org/springframework/core/annotation/AnnotatedElementUtils
  838. at org.springframework.test.context.MetaAnnotationUtils$AnnotationDescriptor.<init>(MetaAnnotationUtils.java:269)
  839. at org.springframework.test.context.MetaAnnotationUtils$AnnotationDescriptor.<init>(MetaAnnotationUtils.java:257)
  840. at org.springframework.test.context.MetaAnnotationUtils$UntypedAnnotationDescriptor.<init>(MetaAnnotationUtils.java:326)
  841. at org.springframework.test.context.MetaAnnotationUtils.findAnnotationDescriptorForTypes(MetaAnnotationUtils.java:171)
  842. at org.springframework.test.context.MetaAnnotationUtils.findAnnotationDescriptorForTypes(MetaAnnotationUtils.java:188)
  843. at org.springframework.test.context.ContextLoaderUtils.buildMergedContextConfiguration(ContextLoaderUtils.java:621)
  844. at org.springframework.test.context.DefaultTestContext.<init>(DefaultTestContext.java:93)
  845. at org.springframework.test.context.TestContextManager.<init>(TestContextManager.java:119)
  846. at org.springframework.test.context.junit4.SpringJUnit4ClassRunner.createTestContextManager(SpringJUnit4ClassRunner.java:120)
  847. at org.springframework.test.context.junit4.SpringJUnit4ClassRunner.<init>(SpringJUnit4ClassRunner.java:109)
  848. at sun.reflect.GeneratedConstructorAccessor5.newInstance(Unknown Source)
  849. at sun.reflect.DelegatingConstructorAccessorImpl.newInstance(DelegatingConstructorAccessorImpl.java:45)
  850. at java.lang.reflect.Constructor.newInstance(Constructor.java:526)
  851. at org.junit.internal.builders.AnnotatedBuilder.buildRunner(AnnotatedBuilder.java:29)
  852. at org.junit.internal.builders.AnnotatedBuilder.runnerForClass(AnnotatedBuilder.java:21)
  853. at org.junit.runners.model.RunnerBuilder.safeRunnerForClass(RunnerBuilder.java:59)
  854. at org.junit.internal.builders.AllDefaultPossibilitiesBuilder.runnerForClass(AllDefaultPossibilitiesBuilder.java:26)
  855. at org.junit.runners.model.RunnerBuilder.safeRunnerForClass(RunnerBuilder.java:59)
  856. at org.junit.internal.requests.ClassRequest.getRunner(ClassRequest.java:26)
  857. at org.apache.maven.surefire.junit4.JUnit4Provider.execute(JUnit4Provider.java:262)
  858. at org.apache.maven.surefire.junit4.JUnit4Provider.executeTestSet(JUnit4Provider.java:153)
  859. at org.apache.maven.surefire.junit4.JUnit4Provider.invoke(JUnit4Provider.java:124)
  860. at sun.reflect.NativeMethodAccessorImpl.invoke0(Native Method)
  861. at sun.reflect.NativeMethodAccessorImpl.invoke(NativeMethodAccessorImpl.java:57)
  862. at sun.reflect.DelegatingMethodAccessorImpl.invoke(DelegatingMethodAccessorImpl.java:43)
  863. at java.lang.reflect.Method.invoke(Method.java:606)
  864. at org.apache.maven.surefire.util.ReflectionUtils.invokeMethodWithArray2(ReflectionUtils.java:208)
  865. at org.apache.maven.surefire.booter.ProviderFactory$ProviderProxy.invoke(ProviderFactory.java:158)
  866. at org.apache.maven.surefire.booter.ProviderFactory.invokeProvider(ProviderFactory.java:86)
  867. at org.apache.maven.surefire.booter.ForkedBooter.runSuitesInProcess(ForkedBooter.java:153)
  868. at org.apache.maven.surefire.booter.ForkedBooter.main(ForkedBooter.java:95)
  869.  
  870. Running com.pcitc.sys.user.service.UserOrganizationJobIT
  871. Tests run: 1, Failures: 0, Errors: 1, Skipped: 0, Time elapsed: 0 sec <<< FAILURE!
  872. initializationError(com.pcitc.sys.user.service.UserOrganizationJobIT) Time elapsed: 0 sec <<< ERROR!
  873. java.lang.NoClassDefFoundError: org/springframework/core/annotation/AnnotatedElementUtils
  874. at org.springframework.test.context.MetaAnnotationUtils$AnnotationDescriptor.<init>(MetaAnnotationUtils.java:269)
  875. at org.springframework.test.context.MetaAnnotationUtils$AnnotationDescriptor.<init>(MetaAnnotationUtils.java:257)
  876. at org.springframework.test.context.MetaAnnotationUtils$UntypedAnnotationDescriptor.<init>(MetaAnnotationUtils.java:326)
  877. at org.springframework.test.context.MetaAnnotationUtils.findAnnotationDescriptorForTypes(MetaAnnotationUtils.java:171)
  878. at org.springframework.test.context.MetaAnnotationUtils.findAnnotationDescriptorForTypes(MetaAnnotationUtils.java:188)
  879. at org.springframework.test.context.MetaAnnotationUtils.findAnnotationDescriptorForTypes(MetaAnnotationUtils.java:188)
  880. at org.springframework.test.context.ContextLoaderUtils.buildMergedContextConfiguration(ContextLoaderUtils.java:621)
  881. at org.springframework.test.context.DefaultTestContext.<init>(DefaultTestContext.java:93)
  882. at org.springframework.test.context.TestContextManager.<init>(TestContextManager.java:119)
  883. at org.springframework.test.context.junit4.SpringJUnit4ClassRunner.createTestContextManager(SpringJUnit4ClassRunner.java:120)
  884. at org.springframework.test.context.junit4.SpringJUnit4ClassRunner.<init>(SpringJUnit4ClassRunner.java:109)
  885. at sun.reflect.GeneratedConstructorAccessor5.newInstance(Unknown Source)
  886. at sun.reflect.DelegatingConstructorAccessorImpl.newInstance(DelegatingConstructorAccessorImpl.java:45)
  887. at java.lang.reflect.Constructor.newInstance(Constructor.java:526)
  888. at org.junit.internal.builders.AnnotatedBuilder.buildRunner(AnnotatedBuilder.java:29)
  889. at org.junit.internal.builders.AnnotatedBuilder.runnerForClass(AnnotatedBuilder.java:21)
  890. at org.junit.runners.model.RunnerBuilder.safeRunnerForClass(RunnerBuilder.java:59)
  891. at org.junit.internal.builders.AllDefaultPossibilitiesBuilder.runnerForClass(AllDefaultPossibilitiesBuilder.java:26)
  892. at org.junit.runners.model.RunnerBuilder.safeRunnerForClass(RunnerBuilder.java:59)
  893. at org.junit.internal.requests.ClassRequest.getRunner(ClassRequest.java:26)
  894. at org.apache.maven.surefire.junit4.JUnit4Provider.execute(JUnit4Provider.java:262)
  895. at org.apache.maven.surefire.junit4.JUnit4Provider.executeTestSet(JUnit4Provider.java:153)
  896. at org.apache.maven.surefire.junit4.JUnit4Provider.invoke(JUnit4Provider.java:124)
  897. at sun.reflect.NativeMethodAccessorImpl.invoke0(Native Method)
  898. at sun.reflect.NativeMethodAccessorImpl.invoke(NativeMethodAccessorImpl.java:57)
  899. at sun.reflect.DelegatingMethodAccessorImpl.invoke(DelegatingMethodAccessorImpl.java:43)
  900. at java.lang.reflect.Method.invoke(Method.java:606)
  901. at org.apache.maven.surefire.util.ReflectionUtils.invokeMethodWithArray2(ReflectionUtils.java:208)
  902. at org.apache.maven.surefire.booter.ProviderFactory$ProviderProxy.invoke(ProviderFactory.java:158)
  903. at org.apache.maven.surefire.booter.ProviderFactory.invokeProvider(ProviderFactory.java:86)
  904. at org.apache.maven.surefire.booter.ForkedBooter.runSuitesInProcess(ForkedBooter.java:153)
  905. at org.apache.maven.surefire.booter.ForkedBooter.main(ForkedBooter.java:95)
  906.  
  907. Running com.pcitc.sys.user.service.UserServiceIT
  908. Tests run: 1, Failures: 0, Errors: 1, Skipped: 0, Time elapsed: 0 sec <<< FAILURE!
  909. initializationError(com.pcitc.sys.user.service.UserServiceIT) Time elapsed: 0 sec <<< ERROR!
  910. java.lang.NoClassDefFoundError: org/springframework/core/annotation/AnnotatedElementUtils
  911. at org.springframework.test.context.MetaAnnotationUtils$AnnotationDescriptor.<init>(MetaAnnotationUtils.java:269)
  912. at org.springframework.test.context.MetaAnnotationUtils$AnnotationDescriptor.<init>(MetaAnnotationUtils.java:257)
  913. at org.springframework.test.context.MetaAnnotationUtils$UntypedAnnotationDescriptor.<init>(MetaAnnotationUtils.java:326)
  914. at org.springframework.test.context.MetaAnnotationUtils.findAnnotationDescriptorForTypes(MetaAnnotationUtils.java:171)
  915. at org.springframework.test.context.MetaAnnotationUtils.findAnnotationDescriptorForTypes(MetaAnnotationUtils.java:188)
  916. at org.springframework.test.context.MetaAnnotationUtils.findAnnotationDescriptorForTypes(MetaAnnotationUtils.java:188)
  917. at org.springframework.test.context.ContextLoaderUtils.buildMergedContextConfiguration(ContextLoaderUtils.java:621)
  918. at org.springframework.test.context.DefaultTestContext.<init>(DefaultTestContext.java:93)
  919. at org.springframework.test.context.TestContextManager.<init>(TestContextManager.java:119)
  920. at org.springframework.test.context.junit4.SpringJUnit4ClassRunner.createTestContextManager(SpringJUnit4ClassRunner.java:120)
  921. at org.springframework.test.context.junit4.SpringJUnit4ClassRunner.<init>(SpringJUnit4ClassRunner.java:109)
  922. at sun.reflect.GeneratedConstructorAccessor5.newInstance(Unknown Source)
  923. at sun.reflect.DelegatingConstructorAccessorImpl.newInstance(DelegatingConstructorAccessorImpl.java:45)
  924. at java.lang.reflect.Constructor.newInstance(Constructor.java:526)
  925. at org.junit.internal.builders.AnnotatedBuilder.buildRunner(AnnotatedBuilder.java:29)
  926. at org.junit.internal.builders.AnnotatedBuilder.runnerForClass(AnnotatedBuilder.java:21)
  927. at org.junit.runners.model.RunnerBuilder.safeRunnerForClass(RunnerBuilder.java:59)
  928. at org.junit.internal.builders.AllDefaultPossibilitiesBuilder.runnerForClass(AllDefaultPossibilitiesBuilder.java:26)
  929. at org.junit.runners.model.RunnerBuilder.safeRunnerForClass(RunnerBuilder.java:59)
  930. at org.junit.internal.requests.ClassRequest.getRunner(ClassRequest.java:26)
  931. at org.apache.maven.surefire.junit4.JUnit4Provider.execute(JUnit4Provider.java:262)
  932. at org.apache.maven.surefire.junit4.JUnit4Provider.executeTestSet(JUnit4Provider.java:153)
  933. at org.apache.maven.surefire.junit4.JUnit4Provider.invoke(JUnit4Provider.java:124)
  934. at sun.reflect.NativeMethodAccessorImpl.invoke0(Native Method)
  935. at sun.reflect.NativeMethodAccessorImpl.invoke(NativeMethodAccessorImpl.java:57)
  936. at sun.reflect.DelegatingMethodAccessorImpl.invoke(DelegatingMethodAccessorImpl.java:43)
  937. at java.lang.reflect.Method.invoke(Method.java:606)
  938. at org.apache.maven.surefire.util.ReflectionUtils.invokeMethodWithArray2(ReflectionUtils.java:208)
  939. at org.apache.maven.surefire.booter.ProviderFactory$ProviderProxy.invoke(ProviderFactory.java:158)
  940. at org.apache.maven.surefire.booter.ProviderFactory.invokeProvider(ProviderFactory.java:86)
  941. at org.apache.maven.surefire.booter.ForkedBooter.runSuitesInProcess(ForkedBooter.java:153)
  942. at org.apache.maven.surefire.booter.ForkedBooter.main(ForkedBooter.java:95)
  943.  
  944. Running com.pcitc.sys.user.task.UserClearRelationTaskIT
  945. Tests run: 1, Failures: 0, Errors: 1, Skipped: 0, Time elapsed: 0 sec <<< FAILURE!
  946. initializationError(com.pcitc.sys.user.task.UserClearRelationTaskIT) Time elapsed: 0 sec <<< ERROR!
  947. java.lang.NoClassDefFoundError: org/springframework/core/annotation/AnnotatedElementUtils
  948. at org.springframework.test.context.MetaAnnotationUtils$AnnotationDescriptor.<init>(MetaAnnotationUtils.java:269)
  949. at org.springframework.test.context.MetaAnnotationUtils$AnnotationDescriptor.<init>(MetaAnnotationUtils.java:257)
  950. at org.springframework.test.context.MetaAnnotationUtils$UntypedAnnotationDescriptor.<init>(MetaAnnotationUtils.java:326)
  951. at org.springframework.test.context.MetaAnnotationUtils.findAnnotationDescriptorForTypes(MetaAnnotationUtils.java:171)
  952. at org.springframework.test.context.MetaAnnotationUtils.findAnnotationDescriptorForTypes(MetaAnnotationUtils.java:188)
  953. at org.springframework.test.context.MetaAnnotationUtils.findAnnotationDescriptorForTypes(MetaAnnotationUtils.java:188)
  954. at org.springframework.test.context.ContextLoaderUtils.buildMergedContextConfiguration(ContextLoaderUtils.java:621)
  955. at org.springframework.test.context.DefaultTestContext.<init>(DefaultTestContext.java:93)
  956. at org.springframework.test.context.TestContextManager.<init>(TestContextManager.java:119)
  957. at org.springframework.test.context.junit4.SpringJUnit4ClassRunner.createTestContextManager(SpringJUnit4ClassRunner.java:120)
  958. at org.springframework.test.context.junit4.SpringJUnit4ClassRunner.<init>(SpringJUnit4ClassRunner.java:109)
  959. at sun.reflect.GeneratedConstructorAccessor5.newInstance(Unknown Source)
  960. at sun.reflect.DelegatingConstructorAccessorImpl.newInstance(DelegatingConstructorAccessorImpl.java:45)
  961. at java.lang.reflect.Constructor.newInstance(Constructor.java:526)
  962. at org.junit.internal.builders.AnnotatedBuilder.buildRunner(AnnotatedBuilder.java:29)
  963. at org.junit.internal.builders.AnnotatedBuilder.runnerForClass(AnnotatedBuilder.java:21)
  964. at org.junit.runners.model.RunnerBuilder.safeRunnerForClass(RunnerBuilder.java:59)
  965. at org.junit.internal.builders.AllDefaultPossibilitiesBuilder.runnerForClass(AllDefaultPossibilitiesBuilder.java:26)
  966. at org.junit.runners.model.RunnerBuilder.safeRunnerForClass(RunnerBuilder.java:59)
  967. at org.junit.internal.requests.ClassRequest.getRunner(ClassRequest.java:26)
  968. at org.apache.maven.surefire.junit4.JUnit4Provider.execute(JUnit4Provider.java:262)
  969. at org.apache.maven.surefire.junit4.JUnit4Provider.executeTestSet(JUnit4Provider.java:153)
  970. at org.apache.maven.surefire.junit4.JUnit4Provider.invoke(JUnit4Provider.java:124)
  971. at sun.reflect.NativeMethodAccessorImpl.invoke0(Native Method)
  972. at sun.reflect.NativeMethodAccessorImpl.invoke(NativeMethodAccessorImpl.java:57)
  973. at sun.reflect.DelegatingMethodAccessorImpl.invoke(DelegatingMethodAccessorImpl.java:43)
  974. at java.lang.reflect.Method.invoke(Method.java:606)
  975. at org.apache.maven.surefire.util.ReflectionUtils.invokeMethodWithArray2(ReflectionUtils.java:208)
  976. at org.apache.maven.surefire.booter.ProviderFactory$ProviderProxy.invoke(ProviderFactory.java:158)
  977. at org.apache.maven.surefire.booter.ProviderFactory.invokeProvider(ProviderFactory.java:86)
  978. at org.apache.maven.surefire.booter.ForkedBooter.runSuitesInProcess(ForkedBooter.java:153)
  979. at org.apache.maven.surefire.booter.ForkedBooter.main(ForkedBooter.java:95)
  980.  
  981. Running com.pcitc.tmp.parentchild.ParentChildTest
  982. Tests run: 1, Failures: 0, Errors: 1, Skipped: 0, Time elapsed: 0 sec <<< FAILURE!
  983. initializationError(com.pcitc.tmp.parentchild.ParentChildTest) Time elapsed: 0 sec <<< ERROR!
  984. java.lang.NoClassDefFoundError: org/springframework/core/annotation/AnnotatedElementUtils
  985. at org.springframework.test.context.MetaAnnotationUtils$AnnotationDescriptor.<init>(MetaAnnotationUtils.java:269)
  986. at org.springframework.test.context.MetaAnnotationUtils$AnnotationDescriptor.<init>(MetaAnnotationUtils.java:257)
  987. at org.springframework.test.context.MetaAnnotationUtils$UntypedAnnotationDescriptor.<init>(MetaAnnotationUtils.java:326)
  988. at org.springframework.test.context.MetaAnnotationUtils.findAnnotationDescriptorForTypes(MetaAnnotationUtils.java:171)
  989. at org.springframework.test.context.MetaAnnotationUtils.findAnnotationDescriptorForTypes(MetaAnnotationUtils.java:188)
  990. at org.springframework.test.context.ContextLoaderUtils.buildMergedContextConfiguration(ContextLoaderUtils.java:621)
  991. at org.springframework.test.context.DefaultTestContext.<init>(DefaultTestContext.java:93)
  992. at org.springframework.test.context.TestContextManager.<init>(TestContextManager.java:119)
  993. at org.springframework.test.context.junit4.SpringJUnit4ClassRunner.createTestContextManager(SpringJUnit4ClassRunner.java:120)
  994. at org.springframework.test.context.junit4.SpringJUnit4ClassRunner.<init>(SpringJUnit4ClassRunner.java:109)
  995. at sun.reflect.GeneratedConstructorAccessor5.newInstance(Unknown Source)
  996. at sun.reflect.DelegatingConstructorAccessorImpl.newInstance(DelegatingConstructorAccessorImpl.java:45)
  997. at java.lang.reflect.Constructor.newInstance(Constructor.java:526)
  998. at org.junit.internal.builders.AnnotatedBuilder.buildRunner(AnnotatedBuilder.java:29)
  999. at org.junit.internal.builders.AnnotatedBuilder.runnerForClass(AnnotatedBuilder.java:21)
  1000. at org.junit.runners.model.RunnerBuilder.safeRunnerForClass(RunnerBuilder.java:59)
  1001. at org.junit.internal.builders.AllDefaultPossibilitiesBuilder.runnerForClass(AllDefaultPossibilitiesBuilder.java:26)
  1002. at org.junit.runners.model.RunnerBuilder.safeRunnerForClass(RunnerBuilder.java:59)
  1003. at org.junit.internal.requests.ClassRequest.getRunner(ClassRequest.java:26)
  1004. at org.apache.maven.surefire.junit4.JUnit4Provider.execute(JUnit4Provider.java:262)
  1005. at org.apache.maven.surefire.junit4.JUnit4Provider.executeTestSet(JUnit4Provider.java:153)
  1006. at org.apache.maven.surefire.junit4.JUnit4Provider.invoke(JUnit4Provider.java:124)
  1007. at sun.reflect.NativeMethodAccessorImpl.invoke0(Native Method)
  1008. at sun.reflect.NativeMethodAccessorImpl.invoke(NativeMethodAccessorImpl.java:57)
  1009. at sun.reflect.DelegatingMethodAccessorImpl.invoke(DelegatingMethodAccessorImpl.java:43)
  1010. at java.lang.reflect.Method.invoke(Method.java:606)
  1011. at org.apache.maven.surefire.util.ReflectionUtils.invokeMethodWithArray2(ReflectionUtils.java:208)
  1012. at org.apache.maven.surefire.booter.ProviderFactory$ProviderProxy.invoke(ProviderFactory.java:158)
  1013. at org.apache.maven.surefire.booter.ProviderFactory.invokeProvider(ProviderFactory.java:86)
  1014. at org.apache.maven.surefire.booter.ForkedBooter.runSuitesInProcess(ForkedBooter.java:153)
  1015. at org.apache.maven.surefire.booter.ForkedBooter.main(ForkedBooter.java:95)
  1016.  
  1017. Running org.apache.shiro.realm.UserRealmIT
  1018. Tests run: 1, Failures: 0, Errors: 1, Skipped: 0, Time elapsed: 0 sec <<< FAILURE!
  1019. initializationError(org.apache.shiro.realm.UserRealmIT) Time elapsed: 0 sec <<< ERROR!
  1020. java.lang.NoClassDefFoundError: org/springframework/core/annotation/AnnotatedElementUtils
  1021. at org.springframework.test.context.MetaAnnotationUtils$AnnotationDescriptor.<init>(MetaAnnotationUtils.java:269)
  1022. at org.springframework.test.context.MetaAnnotationUtils$AnnotationDescriptor.<init>(MetaAnnotationUtils.java:257)
  1023. at org.springframework.test.context.MetaAnnotationUtils$UntypedAnnotationDescriptor.<init>(MetaAnnotationUtils.java:326)
  1024. at org.springframework.test.context.MetaAnnotationUtils.findAnnotationDescriptorForTypes(MetaAnnotationUtils.java:171)
  1025. at org.springframework.test.context.MetaAnnotationUtils.findAnnotationDescriptorForTypes(MetaAnnotationUtils.java:188)
  1026. at org.springframework.test.context.MetaAnnotationUtils.findAnnotationDescriptorForTypes(MetaAnnotationUtils.java:188)
  1027. at org.springframework.test.context.ContextLoaderUtils.buildMergedContextConfiguration(ContextLoaderUtils.java:621)
  1028. at org.springframework.test.context.DefaultTestContext.<init>(DefaultTestContext.java:93)
  1029. at org.springframework.test.context.TestContextManager.<init>(TestContextManager.java:119)
  1030. at org.springframework.test.context.junit4.SpringJUnit4ClassRunner.createTestContextManager(SpringJUnit4ClassRunner.java:120)
  1031. at org.springframework.test.context.junit4.SpringJUnit4ClassRunner.<init>(SpringJUnit4ClassRunner.java:109)
  1032. at sun.reflect.GeneratedConstructorAccessor5.newInstance(Unknown Source)
  1033. at sun.reflect.DelegatingConstructorAccessorImpl.newInstance(DelegatingConstructorAccessorImpl.java:45)
  1034. at java.lang.reflect.Constructor.newInstance(Constructor.java:526)
  1035. at org.junit.internal.builders.AnnotatedBuilder.buildRunner(AnnotatedBuilder.java:29)
  1036. at org.junit.internal.builders.AnnotatedBuilder.runnerForClass(AnnotatedBuilder.java:21)
  1037. at org.junit.runners.model.RunnerBuilder.safeRunnerForClass(RunnerBuilder.java:59)
  1038. at org.junit.internal.builders.AllDefaultPossibilitiesBuilder.runnerForClass(AllDefaultPossibilitiesBuilder.java:26)
  1039. at org.junit.runners.model.RunnerBuilder.safeRunnerForClass(RunnerBuilder.java:59)
  1040. at org.junit.internal.requests.ClassRequest.getRunner(ClassRequest.java:26)
  1041. at org.apache.maven.surefire.junit4.JUnit4Provider.execute(JUnit4Provider.java:262)
  1042. at org.apache.maven.surefire.junit4.JUnit4Provider.executeTestSet(JUnit4Provider.java:153)
  1043. at org.apache.maven.surefire.junit4.JUnit4Provider.invoke(JUnit4Provider.java:124)
  1044. at sun.reflect.NativeMethodAccessorImpl.invoke0(Native Method)
  1045. at sun.reflect.NativeMethodAccessorImpl.invoke(NativeMethodAccessorImpl.java:57)
  1046. at sun.reflect.DelegatingMethodAccessorImpl.invoke(DelegatingMethodAccessorImpl.java:43)
  1047. at java.lang.reflect.Method.invoke(Method.java:606)
  1048. at org.apache.maven.surefire.util.ReflectionUtils.invokeMethodWithArray2(ReflectionUtils.java:208)
  1049. at org.apache.maven.surefire.booter.ProviderFactory$ProviderProxy.invoke(ProviderFactory.java:158)
  1050. at org.apache.maven.surefire.booter.ProviderFactory.invokeProvider(ProviderFactory.java:86)
  1051. at org.apache.maven.surefire.booter.ForkedBooter.runSuitesInProcess(ForkedBooter.java:153)
  1052. at org.apache.maven.surefire.booter.ForkedBooter.main(ForkedBooter.java:95)
  1053.  
  1054. Running org.apache.shiro.session.mgt.eis.OnlineSessionTest
  1055. Tests run: 1, Failures: 0, Errors: 0, Skipped: 0, Time elapsed: 0 sec
  1056.  
  1057. Results :
  1058.  
  1059. Tests in error:
  1060. ? NoClassDefFound org/springframework/core/annotation/AnnotatedElementUtils
  1061. ? NoClassDefFound org/springframework/core/annotation/AnnotatedElementUtils
  1062. ? NoClassDefFound org/springframework/core/annotation/AnnotatedElementUtils
  1063. ? NoClassDefFound org/springframework/core/annotation/AnnotatedElementUtils
  1064. ? NoClassDefFound org/springframework/core/annotation/AnnotatedElementUtils
  1065. ? NoClassDefFound org/springframework/core/annotation/AnnotatedElementUtils
  1066. ? NoClassDefFound org/springframework/core/annotation/AnnotatedElementUtils
  1067. ? NoClassDefFound org/springframework/core/annotation/AnnotatedElementUtils
  1068. ? NoClassDefFound org/springframework/core/annotation/AnnotatedElementUtils
  1069. ? NoClassDefFound org/springframework/core/annotation/AnnotatedElementUtils
  1070. ? NoClassDefFound org/springframework/core/annotation/AnnotatedElementUtils
  1071. ? NoClassDefFound org/springframework/core/annotation/AnnotatedElementUtils
  1072. ? NoClassDefFound org/springframework/core/annotation/AnnotatedElementUtils
  1073. ? NoClassDefFound org/springframework/core/annotation/AnnotatedElementUtils
  1074. ? NoClassDefFound org/springframework/core/annotation/AnnotatedElementUtils
  1075. ? NoClassDefFound org/springframework/core/annotation/AnnotatedElementUtils
  1076. ? NoClassDefFound org/springframework/core/annotation/AnnotatedElementUtils
  1077. ? NoClassDefFound org/springframework/core/annotation/AnnotatedElementUtils
  1078. ? NoClassDefFound org/springframework/core/annotation/AnnotatedElementUtils
  1079. ? NoClassDefFound org/springframework/core/annotation/AnnotatedElementUtils
  1080. ? NoClassDefFound org/springframework/core/annotation/AnnotatedElementUtils
  1081. ? NoClassDefFound org/springframework/core/annotation/AnnotatedElementUtils
  1082. ? NoClassDefFound org/springframework/core/annotation/AnnotatedElementUtils
  1083. ? NoClassDefFound org/springframework/core/annotation/AnnotatedElementUtils
  1084. ? NoClassDefFound org/springframework/core/annotation/AnnotatedElementUtils
  1085. ? NoClassDefFound org/springframework/core/annotation/AnnotatedElementUtils
  1086.  
  1087. Tests run: 66, Failures: 0, Errors: 26

解决方法:

打包跳过测试有两种方法

一是命令行

mvn clean package -Dmaven.test.skip=true

二是写入pom文件

<plugin>
<groupId>org.apache.maven.plugins</groupId>
<artifactId>maven-surefire-plugin</artifactId>
<version>2.4.2</version>
<configuration>
<skipTests>true</skipTests>
</configuration>
</plugin>

运行结果:

[INFO] Scanning for projects...
[INFO] ------------------------------------------------------------------------
[INFO] Reactor Build Order:
[INFO]
[INFO] esp
[INFO] parent
[INFO] common
[INFO] web
[INFO]
[INFO] ------------------------------------------------------------------------
[INFO] Building esp 1.0-SNAPSHOT
[INFO] ------------------------------------------------------------------------
[INFO]
[INFO] --- maven-clean-plugin:2.5:clean (default-clean) @ esp ---
[INFO]
[INFO] ------------------------------------------------------------------------
[INFO] Building parent 1.0-SNAPSHOT
[INFO] ------------------------------------------------------------------------
[INFO]
[INFO] --- maven-clean-plugin:2.5:clean (default-clean) @ esp-parent ---
[INFO]
[INFO] ------------------------------------------------------------------------
[INFO] Building common 1.0-SNAPSHOT
[INFO] ------------------------------------------------------------------------
[INFO]
[INFO] --- maven-clean-plugin:2.5:clean (default-clean) @ esp-common ---
[INFO] Deleting E:\FOS1.0\esp\common\target
[INFO]
[INFO] --- maven-resources-plugin:2.6:resources (default-resources) @ esp-common ---
[INFO] Using 'UTF-8' encoding to copy filtered resources.
[INFO] Copying 14 resources
[INFO]
[INFO] --- maven-compiler-plugin:3.0:compile (default-compile) @ esp-common ---
[INFO] Changes detected - recompiling the module!
[INFO] Compiling 278 source files to E:\FOS1.0\esp\common\target\classes
[WARNING] /E:/FOS1.0/esp/common/src/main/java/com/pcitc/common/utils/security/Coder.java:[3,16] sun.misc.BASE64Decoder是内部专用 API, 可能会在未来发行版中删除
[WARNING] /E:/FOS1.0/esp/common/src/main/java/com/pcitc/common/utils/security/Coder.java:[4,16] sun.misc.BASE64Encoder是内部专用 API, 可能会在未来发行版中删除
[WARNING] /E:/FOS1.0/esp/common/src/main/java/com/pcitc/common/utils/security/Coder.java:[26,32] sun.misc.BASE64Decoder是内部专用 API, 可能会在未来发行版中删除
[WARNING] /E:/FOS1.0/esp/common/src/main/java/com/pcitc/common/utils/security/Coder.java:[30,21] sun.misc.BASE64Decoder是内部专用 API, 可能会在未来发行版中删除
[WARNING] /E:/FOS1.0/esp/common/src/main/java/com/pcitc/common/utils/security/Coder.java:[41,21] sun.misc.BASE64Encoder是内部专用 API, 可能会在未来发行版中删除
[WARNING] /E:/FOS1.0/esp/common/src/main/java/com/pcitc/common/utils/security/Coder.java:[45,21] sun.misc.BASE64Encoder是内部专用 API, 可能会在未来发行版中删除
[WARNING] /E:/FOS1.0/esp/common/src/main/java/com/pcitc/common/repository/hibernate/HibernateUtils.java: 某些输入文件使用或覆盖了已过时的 API。
[WARNING] /E:/FOS1.0/esp/common/src/main/java/com/pcitc/common/repository/hibernate/HibernateUtils.java: 有关详细信息, 请使用 -Xlint:deprecation 重新编译。
[WARNING] /E:/FOS1.0/esp/common/src/main/java/com/pcitc/common/cache/BaseCacheAspect.java: 某些输入文件使用了未经检查或不安全的操作。
[WARNING] /E:/FOS1.0/esp/common/src/main/java/com/pcitc/common/cache/BaseCacheAspect.java: 有关详细信息, 请使用 -Xlint:unchecked 重新编译。
[INFO]
[INFO] --- maven-resources-plugin:2.6:testResources (default-testResources) @ esp-common ---
[INFO] Not copying test resources
[INFO]
[INFO] --- maven-compiler-plugin:3.0:testCompile (default-testCompile) @ esp-common ---
[INFO] Not compiling test sources
[INFO]
[INFO] --- maven-surefire-plugin:2.13:test (default-test) @ esp-common ---
[INFO] Tests are skipped.
[INFO]
[INFO] --- maven-jar-plugin:2.4:jar (default-jar) @ esp-common ---
[INFO] Building jar: E:\FOS1.0\esp\common\target\esp-common.jar
[INFO]
[INFO] ------------------------------------------------------------------------
[INFO] Building web 1.0-SNAPSHOT
[INFO] ------------------------------------------------------------------------
[INFO]
[INFO] --- maven-clean-plugin:2.5:clean (default-clean) @ esp-web ---
[INFO] Deleting E:\FOS1.0\esp\web\target
[INFO]
[INFO] --- maven-resources-plugin:2.6:resources (default-resources) @ esp-web ---
[INFO] Using 'UTF-8' encoding to copy filtered resources.
[INFO] Copying 35 resources
[INFO]
[INFO] --- maven-compiler-plugin:3.0:compile (default-compile) @ esp-web ---
[INFO] Changes detected - recompiling the module!
[INFO] Compiling 559 source files to E:\FOS1.0\esp\web\target\classes
[WARNING] /E:/FOS1.0/esp/web/src/main/java/com/pcitc/modules/fos/exhibition/wsclient/qry/nodebylink/RequestBody.java:[11,31] 编码UTF-8的不可映射字符
[WARNING] /E:/FOS1.0/esp/web/src/main/java/com/pcitc/modules/fos/exhibition/wsclient/qry/nodebylink/RequestBody.java:[11,32] 编码UTF-8的不可映射字符
[WARNING] /E:/FOS1.0/esp/web/src/main/java/com/pcitc/modules/fos/exhibition/wsclient/qry/nodebylink/RequestBody.java:[11,39] 编码UTF-8的不可映射字符
[WARNING] /E:/FOS1.0/esp/web/src/main/java/com/pcitc/modules/fos/exhibition/wsclient/qry/nodebylink/RequestBody.java:[13,7] 编码UTF-8的不可映射字符
[WARNING] /E:/FOS1.0/esp/web/src/main/java/com/pcitc/modules/fos/exhibition/wsclient/qry/nodebylink/RequestBody.java:[13,8] 编码UTF-8的不可映射字符
[WARNING] /E:/FOS1.0/esp/web/src/main/java/com/pcitc/modules/fos/exhibition/wsclient/qry/nodebylink/RequestBody.java:[13,9] 编码UTF-8的不可映射字符
[WARNING] /E:/FOS1.0/esp/web/src/main/java/com/pcitc/modules/fos/exhibition/wsclient/qry/nodebylink/RequestBody.java:[13,10] 编码UTF-8的不可映射字符
[WARNING] /E:/FOS1.0/esp/web/src/main/java/com/pcitc/modules/fos/exhibition/wsclient/qry/nodebylink/RequestBody.java:[13,14] 编码UTF-8的不可映射字符
[WARNING] /E:/FOS1.0/esp/web/src/main/java/com/pcitc/modules/fos/exhibition/wsclient/qry/nodebylink/RequestBody.java:[13,15] 编码UTF-8的不可映射字符
[WARNING] /E:/FOS1.0/esp/web/src/main/java/com/pcitc/modules/fos/exhibition/wsclient/qry/nodebylink/RequestBody.java:[13,17] 编码UTF-8的不可映射字符
[WARNING] /E:/FOS1.0/esp/web/src/main/java/com/pcitc/modules/fos/exhibition/wsclient/qry/nodebylink/RequestBody.java:[13,18] 编码UTF-8的不可映射字符
[WARNING] /E:/FOS1.0/esp/web/src/main/java/com/pcitc/modules/fos/exhibition/wsclient/qry/nodebylink/RequestBody.java:[13,19] 编码UTF-8的不可映射字符
[WARNING] /E:/FOS1.0/esp/web/src/main/java/com/pcitc/modules/fos/exhibition/wsclient/qry/nodebylink/RequestBody.java:[13,20] 编码UTF-8的不可映射字符
[WARNING] /E:/FOS1.0/esp/web/src/main/java/com/pcitc/modules/fos/exhibition/wsclient/qry/nodebylink/RequestBody.java:[13,21] 编码UTF-8的不可映射字符
[WARNING] /E:/FOS1.0/esp/web/src/main/java/com/pcitc/modules/fos/exhibition/wsclient/qry/nodebylink/RequestBody.java:[13,23] 编码UTF-8的不可映射字符
[WARNING] /E:/FOS1.0/esp/web/src/main/java/com/pcitc/modules/fos/exhibition/wsclient/qry/nodebylink/RequestBody.java:[13,24] 编码UTF-8的不可映射字符
[WARNING] /E:/FOS1.0/esp/web/src/main/java/com/pcitc/modules/fos/exhibition/wsclient/qry/nodebylink/RequestBody.java:[13,25] 编码UTF-8的不可映射字符
[WARNING] /E:/FOS1.0/esp/web/src/main/java/com/pcitc/modules/fos/exhibition/wsclient/qry/nodebylink/RequestBody.java:[13,26] 编码UTF-8的不可映射字符
[WARNING] /E:/FOS1.0/esp/web/src/main/java/com/pcitc/modules/fos/exhibition/wsclient/qry/nodebylink/RequestBody.java:[13,28] 编码UTF-8的不可映射字符
[WARNING] /E:/FOS1.0/esp/web/src/main/java/com/pcitc/modules/fos/exhibition/wsclient/qry/nodebylink/RequestBody.java:[13,30] 编码UTF-8的不可映射字符
[WARNING] /E:/FOS1.0/esp/web/src/main/java/com/pcitc/modules/fos/exhibition/wsclient/qry/nodebylink/RequestBody.java:[13,31] 编码UTF-8的不可映射字符
[WARNING] /E:/FOS1.0/esp/web/src/main/java/com/pcitc/modules/fos/exhibition/wsclient/qry/nodebylink/RequestBody.java:[13,32] 编码UTF-8的不可映射字符
[WARNING] /E:/FOS1.0/esp/web/src/main/java/com/pcitc/modules/fos/exhibition/wsclient/qry/nodebylink/RequestBody.java:[13,33] 编码UTF-8的不可映射字符
[WARNING] /E:/FOS1.0/esp/web/src/main/java/com/pcitc/modules/fos/exhibition/wsclient/qry/nodebylink/RequestBody.java:[13,34] 编码UTF-8的不可映射字符
[WARNING] /E:/FOS1.0/esp/web/src/main/java/com/pcitc/modules/fos/exhibition/wsclient/qry/nodebylink/RequestBody.java:[13,36] 编码UTF-8的不可映射字符
[WARNING] /E:/FOS1.0/esp/web/src/main/java/com/pcitc/modules/fos/exhibition/wsclient/qry/nodebylink/RequestBody.java:[63,8] 编码UTF-8的不可映射字符
[WARNING] /E:/FOS1.0/esp/web/src/main/java/com/pcitc/modules/fos/exhibition/wsclient/qry/nodebylink/RequestBody.java:[63,9] 编码UTF-8的不可映射字符
[WARNING] /E:/FOS1.0/esp/web/src/main/java/com/pcitc/modules/fos/exhibition/wsclient/qry/nodebylink/RequestBody.java:[63,20] 编码UTF-8的不可映射字符
[WARNING] /E:/FOS1.0/esp/web/src/main/java/com/pcitc/modules/fos/exhibition/wsclient/qry/nodebylink/RequestBody.java:[63,21] 编码UTF-8的不可映射字符
[WARNING] /E:/FOS1.0/esp/web/src/main/java/com/pcitc/modules/fos/exhibition/wsclient/qry/nodebylink/RequestBody.java:[63,22] 编码UTF-8的不可映射字符
[WARNING] /E:/FOS1.0/esp/web/src/main/java/com/pcitc/modules/fos/exhibition/wsclient/qry/nodebylink/RequestBody.java:[63,24] 编码UTF-8的不可映射字符
[WARNING] /E:/FOS1.0/esp/web/src/main/java/com/pcitc/modules/fos/exhibition/wsclient/qry/nodebylink/RequestBody.java:[63,26] 编码UTF-8的不可映射字符
[WARNING] /E:/FOS1.0/esp/web/src/main/java/com/pcitc/modules/fos/exhibition/wsclient/qry/nodebylink/RequestBody.java:[63,27] 编码UTF-8的不可映射字符
[WARNING] /E:/FOS1.0/esp/web/src/main/java/com/pcitc/modules/fos/exhibition/wsclient/qry/nodebylink/RequestBody.java:[75,8] 编码UTF-8的不可映射字符
[WARNING] /E:/FOS1.0/esp/web/src/main/java/com/pcitc/modules/fos/exhibition/wsclient/qry/nodebylink/RequestBody.java:[75,9] 编码UTF-8的不可映射字符
[WARNING] /E:/FOS1.0/esp/web/src/main/java/com/pcitc/modules/fos/exhibition/wsclient/qry/nodebylink/RequestBody.java:[75,10] 编码UTF-8的不可映射字符
[WARNING] /E:/FOS1.0/esp/web/src/main/java/com/pcitc/modules/fos/exhibition/wsclient/qry/nodebylink/RequestBody.java:[75,11] 编码UTF-8的不可映射字符
[WARNING] /E:/FOS1.0/esp/web/src/main/java/com/pcitc/modules/fos/exhibition/wsclient/qry/nodebylink/RequestBody.java:[75,21] 编码UTF-8的不可映射字符
[WARNING] /E:/FOS1.0/esp/web/src/main/java/com/pcitc/modules/fos/exhibition/wsclient/qry/nodebylink/RequestBody.java:[75,22] 编码UTF-8的不可映射字符
[WARNING] /E:/FOS1.0/esp/web/src/main/java/com/pcitc/modules/fos/exhibition/wsclient/qry/nodebylink/RequestBody.java:[75,23] 编码UTF-8的不可映射字符
[WARNING] /E:/FOS1.0/esp/web/src/main/java/com/pcitc/modules/fos/exhibition/wsclient/qry/nodebylink/RequestBody.java:[75,25] 编码UTF-8的不可映射字符
[WARNING] /E:/FOS1.0/esp/web/src/main/java/com/pcitc/modules/fos/exhibition/wsclient/qry/nodebylink/RequestBody.java:[75,27] 编码UTF-8的不可映射字符
[WARNING] /E:/FOS1.0/esp/web/src/main/java/com/pcitc/modules/fos/exhibition/wsclient/qry/nodebylink/RequestBody.java:[75,28] 编码UTF-8的不可映射字符
[WARNING] /E:/FOS1.0/esp/web/src/main/java/com/pcitc/modules/fos/exhibition/wsclient/qry/nodebylink/RequestBody.java:[87,8] 编码UTF-8的不可映射字符
[WARNING] /E:/FOS1.0/esp/web/src/main/java/com/pcitc/modules/fos/exhibition/wsclient/qry/nodebylink/RequestBody.java:[87,9] 编码UTF-8的不可映射字符
[WARNING] /E:/FOS1.0/esp/web/src/main/java/com/pcitc/modules/fos/exhibition/wsclient/qry/nodebylink/RequestBody.java:[87,18] 编码UTF-8的不可映射字符
[WARNING] /E:/FOS1.0/esp/web/src/main/java/com/pcitc/modules/fos/exhibition/wsclient/qry/nodebylink/RequestBody.java:[87,19] 编码UTF-8的不可映射字符
[WARNING] /E:/FOS1.0/esp/web/src/main/java/com/pcitc/modules/fos/exhibition/wsclient/qry/nodebylink/RequestBody.java:[87,20] 编码UTF-8的不可映射字符
[WARNING] /E:/FOS1.0/esp/web/src/main/java/com/pcitc/modules/fos/exhibition/wsclient/qry/nodebylink/RequestBody.java:[87,22] 编码UTF-8的不可映射字符
[WARNING] /E:/FOS1.0/esp/web/src/main/java/com/pcitc/modules/fos/exhibition/wsclient/qry/nodebylink/RequestBody.java:[87,24] 编码UTF-8的不可映射字符
[WARNING] /E:/FOS1.0/esp/web/src/main/java/com/pcitc/modules/fos/exhibition/wsclient/qry/nodebylink/RequestBody.java:[87,25] 编码UTF-8的不可映射字符
[WARNING] /E:/FOS1.0/esp/web/src/main/java/com/pcitc/modules/fos/exhibition/wsclient/qry/nodebylink/RequestBody.java:[99,8] 编码UTF-8的不可映射字符
[WARNING] /E:/FOS1.0/esp/web/src/main/java/com/pcitc/modules/fos/exhibition/wsclient/qry/nodebylink/RequestBody.java:[99,9] 编码UTF-8的不可映射字符
[WARNING] /E:/FOS1.0/esp/web/src/main/java/com/pcitc/modules/fos/exhibition/wsclient/qry/nodebylink/RequestBody.java:[99,10] 编码UTF-8的不可映射字符
[WARNING] /E:/FOS1.0/esp/web/src/main/java/com/pcitc/modules/fos/exhibition/wsclient/qry/nodebylink/RequestBody.java:[99,11] 编码UTF-8的不可映射字符
[WARNING] /E:/FOS1.0/esp/web/src/main/java/com/pcitc/modules/fos/exhibition/wsclient/qry/nodebylink/RequestBody.java:[99,19] 编码UTF-8的不可映射字符
[WARNING] /E:/FOS1.0/esp/web/src/main/java/com/pcitc/modules/fos/exhibition/wsclient/qry/nodebylink/RequestBody.java:[99,20] 编码UTF-8的不可映射字符
[WARNING] /E:/FOS1.0/esp/web/src/main/java/com/pcitc/modules/fos/exhibition/wsclient/qry/nodebylink/RequestBody.java:[99,21] 编码UTF-8的不可映射字符
[WARNING] /E:/FOS1.0/esp/web/src/main/java/com/pcitc/modules/fos/exhibition/wsclient/qry/nodebylink/RequestBody.java:[99,23] 编码UTF-8的不可映射字符
[WARNING] /E:/FOS1.0/esp/web/src/main/java/com/pcitc/modules/fos/exhibition/wsclient/qry/nodebylink/RequestBody.java:[99,25] 编码UTF-8的不可映射字符
[WARNING] /E:/FOS1.0/esp/web/src/main/java/com/pcitc/modules/fos/exhibition/wsclient/qry/nodebylink/RequestBody.java:[99,26] 编码UTF-8的不可映射字符
[WARNING] /E:/FOS1.0/esp/web/src/main/java/com/pcitc/modules/fos/exhibition/wsclient/qry/nodebylink/RequestBody.java:[111,8] 编码UTF-8的不可映射字符
[WARNING] /E:/FOS1.0/esp/web/src/main/java/com/pcitc/modules/fos/exhibition/wsclient/qry/nodebylink/RequestBody.java:[111,9] 编码UTF-8的不可映射字符
[WARNING] /E:/FOS1.0/esp/web/src/main/java/com/pcitc/modules/fos/exhibition/wsclient/qry/nodebylink/RequestBody.java:[111,24] 编码UTF-8的不可映射字符
[WARNING] /E:/FOS1.0/esp/web/src/main/java/com/pcitc/modules/fos/exhibition/wsclient/qry/nodebylink/RequestBody.java:[111,25] 编码UTF-8的不可映射字符
[WARNING] /E:/FOS1.0/esp/web/src/main/java/com/pcitc/modules/fos/exhibition/wsclient/qry/nodebylink/RequestBody.java:[111,26] 编码UTF-8的不可映射字符
[WARNING] /E:/FOS1.0/esp/web/src/main/java/com/pcitc/modules/fos/exhibition/wsclient/qry/nodebylink/RequestBody.java:[111,28] 编码UTF-8的不可映射字符
[WARNING] /E:/FOS1.0/esp/web/src/main/java/com/pcitc/modules/fos/exhibition/wsclient/qry/nodebylink/RequestBody.java:[111,30] 编码UTF-8的不可映射字符
[WARNING] /E:/FOS1.0/esp/web/src/main/java/com/pcitc/modules/fos/exhibition/wsclient/qry/nodebylink/RequestBody.java:[111,31] 编码UTF-8的不可映射字符
[WARNING] /E:/FOS1.0/esp/web/src/main/java/com/pcitc/modules/fos/exhibition/wsclient/qry/nodebylink/RequestBody.java:[123,8] 编码UTF-8的不可映射字符
[WARNING] /E:/FOS1.0/esp/web/src/main/java/com/pcitc/modules/fos/exhibition/wsclient/qry/nodebylink/RequestBody.java:[123,9] 编码UTF-8的不可映射字符
[WARNING] /E:/FOS1.0/esp/web/src/main/java/com/pcitc/modules/fos/exhibition/wsclient/qry/nodebylink/RequestBody.java:[123,10] 编码UTF-8的不可映射字符
[WARNING] /E:/FOS1.0/esp/web/src/main/java/com/pcitc/modules/fos/exhibition/wsclient/qry/nodebylink/RequestBody.java:[123,11] 编码UTF-8的不可映射字符
[WARNING] /E:/FOS1.0/esp/web/src/main/java/com/pcitc/modules/fos/exhibition/wsclient/qry/nodebylink/RequestBody.java:[123,25] 编码UTF-8的不可映射字符
[WARNING] /E:/FOS1.0/esp/web/src/main/java/com/pcitc/modules/fos/exhibition/wsclient/qry/nodebylink/RequestBody.java:[123,26] 编码UTF-8的不可映射字符
[WARNING] /E:/FOS1.0/esp/web/src/main/java/com/pcitc/modules/fos/exhibition/wsclient/qry/nodebylink/RequestBody.java:[123,27] 编码UTF-8的不可映射字符
[WARNING] /E:/FOS1.0/esp/web/src/main/java/com/pcitc/modules/fos/exhibition/wsclient/qry/nodebylink/RequestBody.java:[123,29] 编码UTF-8的不可映射字符
[WARNING] /E:/FOS1.0/esp/web/src/main/java/com/pcitc/modules/fos/exhibition/wsclient/qry/nodebylink/RequestBody.java:[123,31] 编码UTF-8的不可映射字符
[WARNING] /E:/FOS1.0/esp/web/src/main/java/com/pcitc/modules/fos/exhibition/wsclient/qry/nodebylink/RequestBody.java:[123,32] 编码UTF-8的不可映射字符
[WARNING] /E:/FOS1.0/esp/web/src/main/java/com/pcitc/modules/fos/exhibition/wsclient/qry/nodebylink/RequestBody.java:[135,8] 编码UTF-8的不可映射字符
[WARNING] /E:/FOS1.0/esp/web/src/main/java/com/pcitc/modules/fos/exhibition/wsclient/qry/nodebylink/RequestBody.java:[135,9] 编码UTF-8的不可映射字符
[WARNING] /E:/FOS1.0/esp/web/src/main/java/com/pcitc/modules/fos/exhibition/wsclient/qry/nodebylink/RequestBody.java:[135,18] 编码UTF-8的不可映射字符
[WARNING] /E:/FOS1.0/esp/web/src/main/java/com/pcitc/modules/fos/exhibition/wsclient/qry/nodebylink/RequestBody.java:[135,19] 编码UTF-8的不可映射字符
[WARNING] /E:/FOS1.0/esp/web/src/main/java/com/pcitc/modules/fos/exhibition/wsclient/qry/nodebylink/RequestBody.java:[135,20] 编码UTF-8的不可映射字符
[WARNING] /E:/FOS1.0/esp/web/src/main/java/com/pcitc/modules/fos/exhibition/wsclient/qry/nodebylink/RequestBody.java:[135,22] 编码UTF-8的不可映射字符
[WARNING] /E:/FOS1.0/esp/web/src/main/java/com/pcitc/modules/fos/exhibition/wsclient/qry/nodebylink/RequestBody.java:[135,24] 编码UTF-8的不可映射字符
[WARNING] /E:/FOS1.0/esp/web/src/main/java/com/pcitc/modules/fos/exhibition/wsclient/qry/nodebylink/RequestBody.java:[135,25] 编码UTF-8的不可映射字符
[WARNING] /E:/FOS1.0/esp/web/src/main/java/com/pcitc/modules/fos/exhibition/wsclient/qry/nodebylink/RequestBody.java:[147,8] 编码UTF-8的不可映射字符
[WARNING] /E:/FOS1.0/esp/web/src/main/java/com/pcitc/modules/fos/exhibition/wsclient/qry/nodebylink/RequestBody.java:[147,9] 编码UTF-8的不可映射字符
[WARNING] /E:/FOS1.0/esp/web/src/main/java/com/pcitc/modules/fos/exhibition/wsclient/qry/nodebylink/RequestBody.java:[147,10] 编码UTF-8的不可映射字符
[WARNING] /E:/FOS1.0/esp/web/src/main/java/com/pcitc/modules/fos/exhibition/wsclient/qry/nodebylink/RequestBody.java:[147,11] 编码UTF-8的不可映射字符
[WARNING] /E:/FOS1.0/esp/web/src/main/java/com/pcitc/modules/fos/exhibition/wsclient/qry/nodebylink/RequestBody.java:[147,19] 编码UTF-8的不可映射字符
[WARNING] /E:/FOS1.0/esp/web/src/main/java/com/pcitc/modules/fos/exhibition/wsclient/qry/nodebylink/RequestBody.java:[147,20] 编码UTF-8的不可映射字符
[WARNING] /E:/FOS1.0/esp/web/src/main/java/com/pcitc/modules/fos/exhibition/wsclient/qry/nodebylink/RequestBody.java:[147,21] 编码UTF-8的不可映射字符
[WARNING] /E:/FOS1.0/esp/web/src/main/java/com/pcitc/modules/fos/exhibition/wsclient/qry/nodebylink/RequestBody.java:[147,23] 编码UTF-8的不可映射字符
[WARNING] /E:/FOS1.0/esp/web/src/main/java/com/pcitc/modules/fos/exhibition/wsclient/qry/nodebylink/RequestBody.java:[147,25] 编码UTF-8的不可映射字符
[WARNING] /E:/FOS1.0/esp/web/src/main/java/com/pcitc/modules/fos/exhibition/wsclient/qry/nodebylink/RequestBody.java:[147,26] 编码UTF-8的不可映射字符
[WARNING] /E:/FOS1.0/esp/web/src/main/java/com/pcitc/modules/fos/exhibition/wsclient/qry/nodebylink/RequestBody.java:[159,8] 编码UTF-8的不可映射字符
[WARNING] /E:/FOS1.0/esp/web/src/main/java/com/pcitc/modules/fos/exhibition/wsclient/qry/nodebylink/RequestBody.java:[159,9] 编码UTF-8的不可映射字符
[WARNING] /E:/FOS1.0/esp/web/src/main/java/com/pcitc/modules/fos/exhibition/wsclient/qry/nodebylink/RequestBody.java:[159,16] 编码UTF-8的不可映射字符
[INFO]
[INFO] --- maven-resources-plugin:2.6:testResources (default-testResources) @ esp-web ---
[INFO] Not copying test resources
[INFO]
[INFO] --- maven-compiler-plugin:3.0:testCompile (default-testCompile) @ esp-web ---
[INFO] Not compiling test sources
[INFO]
[INFO] --- maven-surefire-plugin:2.13:test (default-test) @ esp-web ---
[INFO] Tests are skipped.
[INFO]
[INFO] --- maven-war-plugin:2.3:war (default-war) @ esp-web ---
[INFO] Packaging webapp
[INFO] Assembling webapp [esp-web] in [E:\FOS1.0\esp\web\target\esp-web]
[INFO] Processing war project
[INFO] Copying webapp resources [E:\FOS1.0\esp\web\src\main\webapp]
[INFO] Webapp assembled in [26002 msecs]
[INFO] Building war: E:\FOS1.0\esp\web\target\mvm.war
[INFO] ------------------------------------------------------------------------
[INFO] Reactor Summary:
[INFO]
[INFO] esp ................................................ SUCCESS [ 0.215 s]
[INFO] parent ............................................. SUCCESS [ 0.011 s]
[INFO] common ............................................. SUCCESS [ 10.358 s]
[INFO] web ................................................ SUCCESS [ 48.976 s]
[INFO] ------------------------------------------------------------------------
[INFO] BUILD SUCCESS
[INFO] ------------------------------------------------------------------------
[INFO] Total time: 59.848 s
[INFO] Finished at: 2018-01-31T14:12:30+08:00
[INFO] Final Memory: 36M/454M
[INFO] ------------------------------------------------------------------------

Failed to execute goal org.apache.maven.plugins:maven-surefire-plugin:2.5:test的更多相关文章

  1. maven install Failed to execute goal org.apache.maven.plugins:maven-war-plugin:2.1.1:war (default-war) on project web_nanchang

    maven打包成war时,报错:Failed to execute goal org.apache.maven.plugins:maven-war-plugin:2.1.1:war (default- ...

  2. Failed to execute goal org.apache.maven.plugins:maven-antrun-plugin:1.7:run (dist) on project hadoop-kms: An Ant BuildException has occured

    编译cdh版hadoop2.5.0出现的问题 系统: CentOs66 64位 JDK:1.7 Maven: 3.0.5 Protobuf: libprotoc 2.5.0 编译命令: mvn pac ...

  3. Failed to execute goal org.apache.maven.plugins:maven-compiler-plugin:3.1:compile (default-compile) on project LogTest: Compilation failure -> [Help 1]

      [ERROR] Failed to execute goal org.apache.maven.plugins:maven-compiler-plugin:3.1:compile (default ...

  4. [ERROR] Failed to execute goal org.apache.maven.plugins:maven-install-plugin:2.3.1:

    security-sdk-1.0.jar已经存在于D:/secServerSDK-test/src/main/resources/lib下 报错如下: xxxxxx@xxxxxxxx /d/secSe ...

  5. [ERROR] Failed to execute goal org.apache.maven.plugins:maven-archetype-plugin:2.4:create (default-cli) on project standalone-pom: Unable to parse configuration of 3: mojo org.apache.maven.plugins:

    问题: [ERROR] Failed to execute goal org.apache.maven.plugins:maven-archetype-plugin:2.4:create (defau ...

  6. [ERROR] Failed to execute goal org.apache.maven.plugins:maven-jar-plugin:2.3.1:jar (default-jar) on

    [ERROR] Failed to execute goal org.apache.maven.plugins:maven-jar-plugin:2.3.1:jar (default-jar) on ...

  7. maven install 报错Failed to execute goal org.apache.maven.plugins:maven-compiler-plugin:3.1:compile (default-compile) on project*****

    [ERROR]Failed to execute goal org.apache.maven.plugins:maven-compiler-plugin:3.1:compile (default-co ...

  8. Maven Failed to execute goal org.apache.maven.plugins:maven-clean-plugin:2.5:clean Failed to delete access_log

    I'm trying to run simple struts project using maven and tomcat. When I'm trying to exucute next goal ...

  9. 解决Failed to execute goal org.apache.maven.plugins

    1.Maven构建失败 Failed to execute goal org.apache.maven.plugins:maven-compiler-plugin: 2.3 . 2 :compile  ...

  10. Failed to execute goal org.apache.maven.plugins:maven-compiler-plugin:3.1:compile 解决办法

    Maven install失败 Failed to execute goal org.apache.maven.plugins:maven-compiler-plugin:3.1:compile (d ...

随机推荐

  1. Linux学习之九-Linux系统定时任务

    Linux系统定时任务 在一些实际工作中需要机器在某个时间自动执行某个任务,不需要人为在此时刻参与,可以建立一个定时任务. crond 服务是linux下用来周期性的执行某种任务或等待处理某些事件的一 ...

  2. idou老师教你学Istio 29:Envoy启动流程

    1. 功能概述 Envoy启动时,会启动一个进程,并在这个进程中启动很多线程,这样,可以启动很多worker线程,一般worker线程数与核心数相同,每个worker线程处理所有已配置的listene ...

  3. Centos杀死进程kill方法大全

    杀死进程最安全的方法是单纯使用kill命令. 首先使用ps -ef命令确定要杀死进程的PID,然后输入以下命令: # kill -pid 注释:标准的kill命令通常都能达到目的.终止有问题的进程,并 ...

  4. 码云 VS首次提交代码报错:failed to push some refs to 'https://gitee.com/Liu_Cabbage/ASP.NET-MVC-QQ-Connect.git'

    打开命令提示符: 执行合并命令: git pull --rebase origin master 最后总结: 1.多为第一次提交代码,本地和码云仓库不一致,README.md文件不在本地代码目录中 2 ...

  5. mongodb中find $ne null 与$exists的区别

    $ne null 会把空列表也算入,即使不存在. $exists 的识别效果就比较好 1.插入样例数据 db.nullexistsdemo.insertMany( [{ "name" ...

  6. vs调试 iis发布之后的项目

    方法一 启动vs  访问iis地址 即可调试 方法二 点击调试, 选择附加到进程 选择所有用户进程,  选择w3wp.exe  ,附加 , 即可调试

  7. TransactionSynchronizationManager用法和含义(转)

    原文链接:https://blog.csdn.net/ly199108171231/article/details/92984574 当我们有业务需要在事务提交过后进行某一项或者某一系列的业务操作时候 ...

  8. 8、Spring Boot 2.x 服务器部署

    1.8 服务器部署 完整源码: Spring-Boot-Demos 1.8.1 jar包提取出来maven打包(避免每次重复打相同的jar包),pom.xml配置如下: <build> & ...

  9. P2634 [国家集训队]聪聪可可 点分治

    思路:点分治 提交:1次 题解: 不需要什么容斥...接着板子题说: 还是基本思路:对于一颗子树,与之前的子树做贡献. 我们把路径的权值在\(\%3\)意义下分类,即开三个桶\(c[0],c[1],c ...

  10. .net SerialPort

    虚拟串口并定时向虚拟串口定时发数据 http://scorpiomiracle.iteye.com/blog/653923 C#中如何使用SerialPort控件向单片机发送数据? http://zh ...