一 简介

由于在公司构建很多工作,都是使用的maven工作构建的,这种构建方式很大缺点就是所有的工作都需要一步一步的配置,当项目较多,需求变动时,需要很大的精力去修改配置,很费劲

Pipeline即为代码的概念让我们重新认识了CI管道, 这个理念就是去完整的CI/CD管道作为代码,代码可以像程序代码一样被版本控制所管理。前面虽然做过实验,但是不系统,不容易理解,现在重新从零开始整理学习

以下是将管道作为代码的一些优势:

  • 它是可编程的
  • 所有的CI/CD管道配置都可以在一个单一的文件内描述。
  • 它是版本可控制的,就像其它代码一样。
  • 它可以使用宣告管道语法去定义管道,这是一种简单而优雅的方式定制管道。

二 创建一个jenkins的管道工作

2.1 点击创建新任务,选择流水线

2.2 选择如下

具体代码

  1. node {
  2. def mvnHome
  3. stage('Preparation') { // for display purposes
  4. // Get some code from a GitHub repository
  5. git 'https://github.com/jglick/simple-maven-project-with-tests.git'
  6. // Get the Maven tool.
  7. // ** NOTE: This 'M3' Maven tool must be configured
  8. // ** in the global configuration.
  9. mvnHome = tool 'M3'
  10. }
  11. stage('Build') {
  12. // Run the maven build
  13. withEnv(["MVN_HOME=$mvnHome"]) {
  14. if (isUnix()) {
  15. sh '"$MVN_HOME/bin/mvn" -Dmaven.test.failure.ignore clean package'
  16. } else {
  17. bat(/"%MVN_HOME%\bin\mvn" -Dmaven.test.failure.ignore clean package/)
  18. }
  19. }
  20. }
  21. stage('Results') {
  22. junit '**/target/surefire-reports/TEST-*.xml'
  23. archiveArtifacts 'target/*.jar'
  24. }
  25. }

点击保存

2.3 全局工具配置

系统管理---->全局工具配置

这是在所有的pipeline都要使用的工具配置地方,比如Java,Maven,Git等。

比如说你有多个构建agents(jenkins slave agents),构建java代码,和请求使用Java JDK,Maven和Git构建pipeline.所有需要的配置工具都是在全局工具配置里配置。 但在agents上构建代码时,jenkins便 会调用他们。不需要在任何的build agent去安装这些工具。

配置maven工具

选择自动安装

这种方式是自己安装的mvn,在每次构建的时候,因为需要自己下载安装,可以下载安装然后

2.4 点击构建

过程可以在控制台看到信息

  1. Started by user darren ning
  2. Running in Durability level: MAX_SURVIVABILITY
  3. [Pipeline] Start of Pipeline
  4. [Pipeline] node
  5. Running on Jenkins in /root/.jenkins/workspace/jenkins_pipeline_demo
  6. [Pipeline] {
  7. [Pipeline] stage
  8. [Pipeline] { (Preparation)
  9. [Pipeline] git
  10. No credentials specified
  11. Cloning the remote Git repository
  12. Cloning repository https://github.com/jglick/simple-maven-project-with-tests.git
  13. > git init /root/.jenkins/workspace/jenkins_pipeline_demo # timeout=
  14. Fetching upstream changes from https://github.com/jglick/simple-maven-project-with-tests.git
  15. > git --version # timeout=
  16. > git fetch --tags --progress https://github.com/jglick/simple-maven-project-with-tests.git +refs/heads/*:refs/remotes/origin/*
  17. > git config remote.origin.url https://github.com/jglick/simple-maven-project-with-tests.git # timeout=10
  18. > git config --add remote.origin.fetch +refs/heads/*:refs/remotes/origin/* # timeout=10
  19. > git config remote.origin.url https://github.com/jglick/simple-maven-project-with-tests.git # timeout=10
  20. Fetching upstream changes from https://github.com/jglick/simple-maven-project-with-tests.git
  21. > git fetch --tags --progress https://github.com/jglick/simple-maven-project-with-tests.git +refs/heads/*:refs/remotes/origin/*
  22. > git rev-parse refs/remotes/origin/master^{commit} # timeout=10
  23. > git rev-parse refs/remotes/origin/origin/master^{commit} # timeout=10
  24. Checking out Revision b3a39b21ac048d9298986e0d4a1d9f4dd185df8f (refs/remotes/origin/master)
  25. > git config core.sparsecheckout # timeout=10
  26. > git checkout -f b3a39b21ac048d9298986e0d4a1d9f4dd185df8f
  27. > git branch -a -v --no-abbrev # timeout=10
  28. > git checkout -b master b3a39b21ac048d9298986e0d4a1d9f4dd185df8f
  29. Commit message: "Merge pull request #13 from jglick/Jenkinsfile"
  30. First time build. Skipping changelog.
  31. [Pipeline] tool
  32. Unpacking https://repo.maven.apache.org/maven2/org/apache/maven/apache-maven/3.6.2/apache-maven-3.6.2-bin.zip to /root/.jenkins/tools/hudson.tasks.Maven_MavenInstallation/M3 on Jenkins
  33. [Pipeline] }
  34. [Pipeline] // stage
  35. [Pipeline] stage
  36. [Pipeline] { (Build)
  37. [Pipeline] withEnv
  38. [Pipeline] {
  39. [Pipeline] isUnix
  40. [Pipeline] sh
  41. + /root/.jenkins/tools/hudson.tasks.Maven_MavenInstallation/M3/bin/mvn -Dmaven.test.failure.ignore clean package
  42. [INFO] Scanning for projects...
  43. [INFO]
  44. [INFO] ----------------< test:simple-maven-project-with-tests >----------------
  45. [INFO] Building simple-maven-project-with-tests 1.0-SNAPSHOT
  46. [INFO] --------------------------------[ jar ]---------------------------------
  47. Downloading from central: https://repo.maven.apache.org/maven2/org/apache/maven/plugins/maven-clean-plugin/2.5/maven-clean-plugin-2.5.pom
  48. Progress (1): 2.7/3.9 kB
  49. Progress (1): 3.9 kB
  50.  
  51. Downloaded from central: https://repo.maven.apache.org/maven2/org/apache/maven/plugins/maven-clean-plugin/2.5/maven-clean-plugin-2.5.pom (3.9 kB at 1.2 kB/s)
  52. Downloading from central: https://repo.maven.apache.org/maven2/org/apache/maven/plugins/maven-plugins/22/maven-plugins-22.pom
  53. Progress (1): 2.7/13 kB
  54. Progress (1): 5.5/13 kB
  55. Progress (1): 8.2/13 kB
  56. Progress (1): 11/13 kB
  57. Progress (1): 13 kB
  58.  
  59. Downloaded from central: https://repo.maven.apache.org/maven2/org/apache/maven/plugins/maven-plugins/22/maven-plugins-22.pom (13 kB at 9.2 kB/s)
  60. Downloading from central: https://repo.maven.apache.org/maven2/org/apache/maven/maven-parent/21/maven-parent-21.pom
  61. Progress (1): 2.7/26 kB
  62. Progress (1): 5.5/26 kB
  63. Progress (1): 8.2/26 kB
  64. Progress (1): 11/26 kB
  65. Progress (1): 14/26 kB
  66. Progress (1): 16/26 kB
  67. Progress (1): 19/26 kB
  68. Progress (1): 22/26 kB
  69. Progress (1): 25/26 kB
  70. Progress (1): 26 kB
  71.  
  72. Downloaded from central: https://repo.maven.apache.org/maven2/org/apache/maven/maven-parent/21/maven-parent-21.pom (26 kB at 21 kB/s)
  73. Downloading from central: https://repo.maven.apache.org/maven2/org/apache/apache/10/apache-10.pom
  74. Progress (1): 2.7/15 kB
  75. Progress (1): 5.5/15 kB
  76. Progress (1): 8.2/15 kB
  77. Progress (1): 11/15 kB
  78. Progress (1): 14/15 kB
  79. Progress (1): 15 kB
  80.  
  81. Downloaded from central: https://repo.maven.apache.org/maven2/org/apache/apache/10/apache-10.pom (15 kB at 16 kB/s)
  82. Downloading from central: https://repo.maven.apache.org/maven2/org/apache/maven/plugins/maven-clean-plugin/2.5/maven-clean-plugin-2.5.jar
  83. Progress (1): 2.7/25 kB
  84. Progress (1): 5.5/25 kB
  85. Progress (1): 8.2/25 kB
  86. Progress (1): 11/25 kB
  87. Progress (1): 14/25 kB
  88. Progress (1): 16/25 kB
  89. Progress (1): 19/25 kB
  90. Progress (1): 22/25 kB
  91. Progress (1): 25 kB
  92.  
  93. Downloaded from central: https://repo.maven.apache.org/maven2/org/apache/maven/plugins/maven-clean-plugin/2.5/maven-clean-plugin-2.5.jar (25 kB at 28 kB/s)
  94. Downloading from central: https://repo.maven.apache.org/maven2/org/apache/maven/plugins/maven-resources-plugin/2.6/maven-resources-plugin-2.6.pom
  95. Progress (1): 2.7/8.1 kB
  96. Progress (1): 5.5/8.1 kB
  97. Progress (1): 8.1 kB
  98.  
  99. Downloaded from central: https://repo.maven.apache.org/maven2/org/apache/maven/plugins/maven-resources-plugin/2.6/maven-resources-plugin-2.6.pom (8.1 kB at 9.3 kB/s)
  100. Downloading from central: https://repo.maven.apache.org/maven2/org/apache/maven/plugins/maven-plugins/23/maven-plugins-23.pom
  101. Progress (1): 2.7/9.2 kB
  102. Progress (1): 5.5/9.2 kB
  103. Progress (1): 8.2/9.2 kB
  104. Progress (1): 9.2 kB
  105.  
  106. Downloaded from central: https://repo.maven.apache.org/maven2/org/apache/maven/plugins/maven-plugins/23/maven-plugins-23.pom (9.2 kB at 13 kB/s)
  107. Downloading from central: https://repo.maven.apache.org/maven2/org/apache/maven/maven-parent/22/maven-parent-22.pom
  108. Progress (1): 2.7/30 kB
  109. Progress (1): 5.5/30 kB
  110. Progress (1): 8.2/30 kB
  111. Progress (1): 11/30 kB
  112. Progress (1): 14/30 kB
  113. Progress (1): 16/30 kB
  114. Progress (1): 19/30 kB
  115. Progress (1): 22/30 kB
  116. Progress (1): 25/30 kB
  117. Progress (1): 27/30 kB
  118. Progress (1): 30 kB
  119.  
  120. Downloaded from central: https://repo.maven.apache.org/maven2/org/apache/maven/maven-parent/22/maven-parent-22.pom (30 kB at 51 kB/s)
  121. Downloading from central: https://repo.maven.apache.org/maven2/org/apache/apache/11/apache-11.pom
  122. Progress (1): 2.7/15 kB
  123. Progress (1): 5.5/15 kB
  124. Progress (1): 8.2/15 kB
  125. Progress (1): 11/15 kB
  126. Progress (1): 14/15 kB
  127. Progress (1): 15 kB
  128.  
  129. Downloaded from central: https://repo.maven.apache.org/maven2/org/apache/apache/11/apache-11.pom (15 kB at 18 kB/s)
  130. Downloading from central: https://repo.maven.apache.org/maven2/org/apache/maven/plugins/maven-resources-plugin/2.6/maven-resources-plugin-2.6.jar
  131. Progress (1): 2.7/30 kB
  132. Progress (1): 5.5/30 kB
  133. Progress (1): 8.2/30 kB
  134. Progress (1): 11/30 kB
  135. Progress (1): 14/30 kB
  136. Progress (1): 16/30 kB
  137. Progress (1): 19/30 kB
  138. Progress (1): 22/30 kB
  139. Progress (1): 25/30 kB
  140. Progress (1): 27/30 kB
  141. Progress (1): 30 kB
  142.  
  143. Downloaded from central: https://repo.maven.apache.org/maven2/org/apache/maven/plugins/maven-resources-plugin/2.6/maven-resources-plugin-2.6.jar (30 kB at 50 kB/s)
  144. Downloading from central: https://repo.maven.apache.org/maven2/org/apache/maven/plugins/maven-compiler-plugin/3.1/maven-compiler-plugin-3.1.pom
  145. Progress (1): 2.7/10 kB
  146. Progress (1): 5.5/10 kB
  147. Progress (1): 8.2/10 kB
  148. Progress (1): 10 kB
  149.  
  150. Downloaded from central: https://repo.maven.apache.org/maven2/org/apache/maven/plugins/maven-compiler-plugin/3.1/maven-compiler-plugin-3.1.pom (10 kB at 8.5 kB/s)
  151. Downloading from central: https://repo.maven.apache.org/maven2/org/apache/maven/plugins/maven-plugins/24/maven-plugins-24.pom
  152. Progress (1): 2.7/11 kB
  153. Progress (1): 5.5/11 kB
  154. Progress (1): 8.2/11 kB
  155. Progress (1): 11 kB
  156.  
  157. Downloaded from central: https://repo.maven.apache.org/maven2/org/apache/maven/plugins/maven-plugins/24/maven-plugins-24.pom (11 kB at 9.5 kB/s)
  158. Downloading from central: https://repo.maven.apache.org/maven2/org/apache/maven/maven-parent/23/maven-parent-23.pom
  159. Progress (1): 4.1/33 kB
  160. Progress (1): 8.2/33 kB
  161. Progress (1): 12/33 kB
  162. Progress (1): 16/33 kB
  163. Progress (1): 20/33 kB
  164. Progress (1): 25/33 kB
  165. Progress (1): 29/33 kB
  166. Progress (1): 33 kB
  167.  
  168. Downloaded from central: https://repo.maven.apache.org/maven2/org/apache/maven/maven-parent/23/maven-parent-23.pom (33 kB at 33 kB/s)
  169. Downloading from central: https://repo.maven.apache.org/maven2/org/apache/apache/13/apache-13.pom
  170. Progress (1): 4.1/14 kB
  171. Progress (1): 8.2/14 kB
  172. Progress (1): 12/14 kB
  173. Progress (1): 14 kB
  174.  
  175. Downloaded from central: https://repo.maven.apache.org/maven2/org/apache/apache/13/apache-13.pom (14 kB at 16 kB/s)
  176. Downloading from central: https://repo.maven.apache.org/maven2/org/apache/maven/plugins/maven-compiler-plugin/3.1/maven-compiler-plugin-3.1.jar
  177. Progress (1): 4.1/43 kB
  178. Progress (1): 8.2/43 kB
  179. Progress (1): 12/43 kB
  180. Progress (1): 16/43 kB
  181. Progress (1): 20/43 kB
  182. Progress (1): 25/43 kB
  183. Progress (1): 29/43 kB
  184. Progress (1): 33/43 kB
  185. Progress (1): 37/43 kB
  186. Progress (1): 41/43 kB
  187. Progress (1): 43 kB
  188.  
  189. Downloaded from central: https://repo.maven.apache.org/maven2/org/apache/maven/plugins/maven-compiler-plugin/3.1/maven-compiler-plugin-3.1.jar (43 kB at 48 kB/s)
  190. Downloading from central: https://repo.maven.apache.org/maven2/org/apache/maven/plugins/maven-surefire-plugin/2.18.1/maven-surefire-plugin-2.18.1.pom
  191. Progress (1): 4.1/5.7 kB
  192. Progress (1): 5.7 kB
  193.  
  194. Downloaded from central: https://repo.maven.apache.org/maven2/org/apache/maven/plugins/maven-surefire-plugin/2.18.1/maven-surefire-plugin-2.18.1.pom (5.7 kB at 7.2 kB/s)
  195. Downloading from central: https://repo.maven.apache.org/maven2/org/apache/maven/surefire/surefire/2.18.1/surefire-2.18.1.pom
  196. Progress (1): 4.1/17 kB
  197. Progress (1): 8.2/17 kB
  198. Progress (1): 12/17 kB
  199. Progress (1): 16/17 kB
  200. Progress (1): 17 kB
  201.  
  202. Downloaded from central: https://repo.maven.apache.org/maven2/org/apache/maven/surefire/surefire/2.18.1/surefire-2.18.1.pom (17 kB at 16 kB/s)
  203. Downloading from central: https://repo.maven.apache.org/maven2/org/apache/maven/maven-parent/26/maven-parent-26.pom
  204. Progress (1): 4.1/40 kB
  205. Progress (1): 8.2/40 kB
  206. Progress (1): 12/40 kB
  207. Progress (1): 16/40 kB
  208. Progress (1): 20/40 kB
  209. Progress (1): 25/40 kB
  210. Progress (1): 29/40 kB
  211. Progress (1): 33/40 kB
  212. Progress (1): 37/40 kB
  213. Progress (1): 40 kB
  214.  
  215. Downloaded from central: https://repo.maven.apache.org/maven2/org/apache/maven/maven-parent/26/maven-parent-26.pom (40 kB at 43 kB/s)
  216. Downloading from central: https://repo.maven.apache.org/maven2/org/apache/apache/16/apache-16.pom
  217. Progress (1): 4.1/15 kB
  218. Progress (1): 8.2/15 kB
  219. Progress (1): 12/15 kB
  220. Progress (1): 15 kB
  221.  
  222. Downloaded from central: https://repo.maven.apache.org/maven2/org/apache/apache/16/apache-16.pom (15 kB at 17 kB/s)
  223. Downloading from central: https://repo.maven.apache.org/maven2/org/apache/maven/plugins/maven-surefire-plugin/2.18.1/maven-surefire-plugin-2.18.1.jar
  224. Progress (1): 4.1/37 kB
  225. Progress (1): 8.2/37 kB
  226. Progress (1): 12/37 kB
  227. Progress (1): 16/37 kB
  228. Progress (1): 20/37 kB
  229. Progress (1): 25/37 kB
  230. Progress (1): 29/37 kB
  231. Progress (1): 33/37 kB
  232. Progress (1): 37/37 kB
  233. Progress (1): 37 kB
  234.  
  235. Downloaded from central: https://repo.maven.apache.org/maven2/org/apache/maven/plugins/maven-surefire-plugin/2.18.1/maven-surefire-plugin-2.18.1.jar (37 kB at 62 kB/s)
  236. Downloading from central: https://repo.maven.apache.org/maven2/org/apache/maven/plugins/maven-jar-plugin/2.4/maven-jar-plugin-2.4.pom
  237. Progress (1): 4.1/5.8 kB
  238. Progress (1): 5.8 kB
  239.  
  240. Downloaded from central: https://repo.maven.apache.org/maven2/org/apache/maven/plugins/maven-jar-plugin/2.4/maven-jar-plugin-2.4.pom (5.8 kB at 4.9 kB/s)
  241. Downloading from central: https://repo.maven.apache.org/maven2/org/apache/maven/plugins/maven-jar-plugin/2.4/maven-jar-plugin-2.4.jar
  242. Progress (1): 4.1/34 kB
  243. Progress (1): 8.2/34 kB
  244. Progress (1): 12/34 kB
  245. Progress (1): 16/34 kB
  246. Progress (1): 20/34 kB
  247. Progress (1): 25/34 kB
  248. Progress (1): 29/34 kB
  249. Progress (1): 33/34 kB
  250. Progress (1): 34 kB
  251.  
  252. Downloaded from central: https://repo.maven.apache.org/maven2/org/apache/maven/plugins/maven-jar-plugin/2.4/maven-jar-plugin-2.4.jar (34 kB at 38 kB/s)
  253. Downloading from central: https://repo.maven.apache.org/maven2/junit/junit/4.11/junit-4.11.pom
  254. Progress (1): 2.3 kB
  255.  
  256. Downloaded from central: https://repo.maven.apache.org/maven2/junit/junit/4.11/junit-4.11.pom (2.3 kB at 2.8 kB/s)
  257. Downloading from central: https://repo.maven.apache.org/maven2/org/hamcrest/hamcrest-core/1.3/hamcrest-core-1.3.pom
  258. Progress (1): 766 B
  259.  
  260. Downloaded from central: https://repo.maven.apache.org/maven2/org/hamcrest/hamcrest-core/1.3/hamcrest-core-1.3.pom (766 B at 1.5 kB/s)
  261. Downloading from central: https://repo.maven.apache.org/maven2/org/hamcrest/hamcrest-parent/1.3/hamcrest-parent-1.3.pom
  262. Progress (1): 2.0 kB
  263.  
  264. Downloaded from central: https://repo.maven.apache.org/maven2/org/hamcrest/hamcrest-parent/1.3/hamcrest-parent-1.3.pom (2.0 kB at 2.7 kB/s)
  265. Downloading from central: https://repo.maven.apache.org/maven2/junit/junit/4.11/junit-4.11.jar
  266. Downloading from central: https://repo.maven.apache.org/maven2/org/hamcrest/hamcrest-core/1.3/hamcrest-core-1.3.jar
  267. Progress (1): 4.1/245 kB
  268. Progress (1): 8.2/245 kB
  269. Progress (1): 12/245 kB
  270. Progress (1): 16/245 kB
  271. Progress (1): 20/245 kB
  272. Progress (1): 25/245 kB
  273. Progress (1): 29/245 kB
  274. Progress (1): 33/245 kB
  275. Progress (1): 37/245 kB
  276. Progress (1): 41/245 kB
  277. Progress (1): 45/245 kB
  278. Progress (1): 49/245 kB
  279. Progress (1): 53/245 kB
  280. Progress (1): 57/245 kB
  281. Progress (1): 61/245 kB
  282. Progress (1): 66/245 kB
  283. Progress (1): 70/245 kB
  284. Progress (1): 74/245 kB
  285. Progress (1): 78/245 kB
  286. Progress (1): 82/245 kB
  287. Progress (1): 86/245 kB
  288. Progress (1): 90/245 kB
  289. Progress (1): 94/245 kB
  290. Progress (1): 98/245 kB
  291. Progress (1): 102/245 kB
  292. Progress (1): 106/245 kB
  293. Progress (1): 111/245 kB
  294. Progress (1): 115/245 kB
  295. Progress (1): 119/245 kB
  296. Progress (1): 123/245 kB
  297. Progress (1): 127/245 kB
  298. Progress (1): 131/245 kB
  299. Progress (1): 135/245 kB
  300. Progress (1): 139/245 kB
  301. Progress (1): 143/245 kB
  302. Progress (1): 147/245 kB
  303. Progress (2): 147/245 kB | 2.7/45 kB
  304. Progress (2): 152/245 kB | 2.7/45 kB
  305. Progress (2): 156/245 kB | 2.7/45 kB
  306. Progress (2): 160/245 kB | 2.7/45 kB
  307. Progress (2): 160/245 kB | 5.5/45 kB
  308. Progress (2): 164/245 kB | 5.5/45 kB
  309. Progress (2): 164/245 kB | 8.2/45 kB
  310. Progress (2): 164/245 kB | 11/45 kB
  311. Progress (2): 168/245 kB | 11/45 kB
  312. Progress (2): 172/245 kB | 11/45 kB
  313. Progress (2): 176/245 kB | 11/45 kB
  314. Progress (2): 180/245 kB | 11/45 kB
  315. Progress (2): 180/245 kB | 14/45 kB
  316. Progress (2): 184/245 kB | 14/45 kB
  317. Progress (2): 184/245 kB | 16/45 kB
  318. Progress (2): 184/245 kB | 19/45 kB
  319. Progress (2): 184/245 kB | 22/45 kB
  320. Progress (2): 184/245 kB | 25/45 kB
  321. Progress (2): 188/245 kB | 25/45 kB
  322. Progress (2): 193/245 kB | 25/45 kB
  323. Progress (2): 197/245 kB | 25/45 kB
  324. Progress (2): 201/245 kB | 25/45 kB
  325. Progress (2): 205/245 kB | 25/45 kB
  326. Progress (2): 209/245 kB | 25/45 kB
  327. Progress (2): 213/245 kB | 25/45 kB
  328. Progress (2): 217/245 kB | 25/45 kB
  329. Progress (2): 221/245 kB | 25/45 kB
  330. Progress (2): 225/245 kB | 25/45 kB
  331. Progress (2): 229/245 kB | 25/45 kB
  332. Progress (2): 233/245 kB | 25/45 kB
  333. Progress (2): 238/245 kB | 25/45 kB
  334. Progress (2): 242/245 kB | 25/45 kB
  335. Progress (2): 245 kB | 25/45 kB
  336. Progress (2): 245 kB | 27/45 kB
  337. Progress (2): 245 kB | 30/45 kB
  338. Progress (2): 245 kB | 33/45 kB
  339. Progress (2): 245 kB | 36/45 kB
  340. Progress (2): 245 kB | 38/45 kB
  341. Progress (2): 245 kB | 41/45 kB
  342. Progress (2): 245 kB | 44/45 kB
  343.  
  344. Downloaded from central: https://repo.maven.apache.org/maven2/junit/junit/4.11/junit-4.11.jar (245 kB at 103 kB/s)
  345. Progress (1): 45 kB
  346.  
  347. Downloaded from central: https://repo.maven.apache.org/maven2/org/hamcrest/hamcrest-core/1.3/hamcrest-core-1.3.jar (45 kB at 17 kB/s)
  348. [INFO]
  349. [INFO] --- maven-clean-plugin:2.5:clean (default-clean) @ simple-maven-project-with-tests ---
  350. Downloading from central: https://repo.maven.apache.org/maven2/org/apache/maven/maven-plugin-api/2.0.6/maven-plugin-api-2.0.6.pom
  351. Progress (1): 1.5 kB
  352.  
  353. Downloaded from central: https://repo.maven.apache.org/maven2/org/apache/maven/maven-plugin-api/2.0.6/maven-plugin-api-2.0.6.pom (1.5 kB at 2.1 kB/s)
  354. Downloading from central: https://repo.maven.apache.org/maven2/org/apache/maven/maven/2.0.6/maven-2.0.6.pom
  355. Progress (1): 2.7/9.0 kB
  356. Progress (1): 5.5/9.0 kB
  357. Progress (1): 8.2/9.0 kB
  358. Progress (1): 9.0 kB
  359.  
  360. Downloaded from central: https://repo.maven.apache.org/maven2/org/apache/maven/maven/2.0.6/maven-2.0.6.pom (9.0 kB at 10 kB/s)
  361. Downloading from central: https://repo.maven.apache.org/maven2/org/apache/maven/maven-parent/5/maven-parent-5.pom
  362. Progress (1): 2.7/15 kB
  363. Progress (1): 5.5/15 kB
  364. Progress (1): 8.2/15 kB
  365. Progress (1): 11/15 kB
  366. Progress (1): 14/15 kB
  367. Progress (1): 15 kB
  368.  
  369. Downloaded from central: https://repo.maven.apache.org/maven2/org/apache/maven/maven-parent/5/maven-parent-5.pom (15 kB at 17 kB/s)
  370. Downloading from central: https://repo.maven.apache.org/maven2/org/apache/apache/3/apache-3.pom
  371. Progress (1): 2.7/3.4 kB
  372. Progress (1): 3.4 kB
  373.  
  374. Downloaded from central: https://repo.maven.apache.org/maven2/org/apache/apache/3/apache-3.pom (3.4 kB at 2.8 kB/s)
  375. Downloading from central: https://repo.maven.apache.org/maven2/org/codehaus/plexus/plexus-utils/3.0/plexus-utils-3.0.pom
  376. Progress (1): 2.7/4.1 kB
  377. Progress (1): 4.1 kB
  378.  
  379. Downloaded from central: https://repo.maven.apache.org/maven2/org/codehaus/plexus/plexus-utils/3.0/plexus-utils-3.0.pom (4.1 kB at 4.5 kB/s)
  380. Downloading from central: https://repo.maven.apache.org/maven2/org/sonatype/spice/spice-parent/16/spice-parent-16.pom
  381. Progress (1): 2.7/8.4 kB
  382. Progress (1): 5.5/8.4 kB
  383. Progress (1): 8.2/8.4 kB
  384. Progress (1): 8.4 kB
  385.  
  386. Downloaded from central: https://repo.maven.apache.org/maven2/org/sonatype/spice/spice-parent/16/spice-parent-16.pom (8.4 kB at 9.2 kB/s)
  387. Downloading from central: https://repo.maven.apache.org/maven2/org/sonatype/forge/forge-parent/5/forge-parent-5.pom
  388. Progress (1): 2.7/8.4 kB
  389. Progress (1): 5.5/8.4 kB
  390. Progress (1): 8.2/8.4 kB
  391. Progress (1): 8.4 kB
  392.  
  393. Downloaded from central: https://repo.maven.apache.org/maven2/org/sonatype/forge/forge-parent/5/forge-parent-5.pom (8.4 kB at 6.9 kB/s)
  394. Downloading from central: https://repo.maven.apache.org/maven2/org/apache/maven/maven-plugin-api/2.0.6/maven-plugin-api-2.0.6.jar
  395. Downloading from central: https://repo.maven.apache.org/maven2/org/codehaus/plexus/plexus-utils/3.0/plexus-utils-3.0.jar
  396. Progress (1): 4.1/226 kB
  397. Progress (2): 4.1/226 kB | 2.7/13 kB
  398. Progress (2): 8.2/226 kB | 2.7/13 kB
  399. Progress (2): 12/226 kB | 2.7/13 kB
  400. Progress (2): 16/226 kB | 2.7/13 kB
  401. Progress (2): 16/226 kB | 5.5/13 kB
  402. Progress (2): 16/226 kB | 8.2/13 kB
  403. Progress (2): 20/226 kB | 8.2/13 kB
  404. Progress (2): 20/226 kB | 11/13 kB
  405. Progress (2): 25/226 kB | 11/13 kB
  406. Progress (2): 25/226 kB | 13 kB
  407. Progress (2): 29/226 kB | 13 kB
  408. Progress (2): 33/226 kB | 13 kB
  409. Progress (2): 37/226 kB | 13 kB
  410. Progress (2): 41/226 kB | 13 kB
  411. Progress (2): 45/226 kB | 13 kB
  412. Progress (2): 49/226 kB | 13 kB
  413.  
  414. Downloaded from central: https://repo.maven.apache.org/maven2/org/apache/maven/maven-plugin-api/2.0.6/maven-plugin-api-2.0.6.jar (13 kB at 14 kB/s)
  415. Progress (1): 53/226 kB
  416. Progress (1): 57/226 kB
  417. Progress (1): 61/226 kB
  418. Progress (1): 66/226 kB
  419. Progress (1): 70/226 kB
  420. Progress (1): 74/226 kB
  421. Progress (1): 78/226 kB
  422. Progress (1): 82/226 kB
  423. Progress (1): 86/226 kB
  424. Progress (1): 90/226 kB
  425. Progress (1): 94/226 kB
  426. Progress (1): 98/226 kB
  427. Progress (1): 102/226 kB
  428. Progress (1): 106/226 kB
  429. Progress (1): 111/226 kB
  430. Progress (1): 115/226 kB
  431. Progress (1): 119/226 kB
  432. Progress (1): 123/226 kB
  433. Progress (1): 127/226 kB
  434. Progress (1): 131/226 kB
  435. Progress (1): 135/226 kB
  436. Progress (1): 139/226 kB
  437. Progress (1): 143/226 kB
  438. Progress (1): 147/226 kB
  439. Progress (1): 152/226 kB
  440. Progress (1): 156/226 kB
  441. Progress (1): 160/226 kB
  442. Progress (1): 164/226 kB
  443. Progress (1): 168/226 kB
  444. Progress (1): 172/226 kB
  445. Progress (1): 176/226 kB
  446. Progress (1): 180/226 kB
  447. Progress (1): 184/226 kB
  448. Progress (1): 188/226 kB
  449. Progress (1): 193/226 kB
  450. Progress (1): 197/226 kB
  451. Progress (1): 201/226 kB
  452. Progress (1): 205/226 kB
  453. Progress (1): 209/226 kB
  454. Progress (1): 213/226 kB
  455. Progress (1): 217/226 kB
  456. Progress (1): 221/226 kB
  457. Progress (1): 225/226 kB
  458. Progress (1): 226 kB
  459.  
  460. Downloaded from central: https://repo.maven.apache.org/maven2/org/codehaus/plexus/plexus-utils/3.0/plexus-utils-3.0.jar (226 kB at 96 kB/s)
  461. [INFO]
  462. [INFO] --- maven-resources-plugin:2.6:resources (default-resources) @ simple-maven-project-with-tests ---
  463. Downloading from central: https://repo.maven.apache.org/maven2/org/apache/maven/maven-project/2.0.6/maven-project-2.0.6.pom
  464. Progress (1): 2.6 kB
  465.  
  466. Downloaded from central: https://repo.maven.apache.org/maven2/org/apache/maven/maven-project/2.0.6/maven-project-2.0.6.pom (2.6 kB at 4.6 kB/s)
  467. Downloading from central: https://repo.maven.apache.org/maven2/org/apache/maven/maven-settings/2.0.6/maven-settings-2.0.6.pom
  468. Progress (1): 2.0 kB
  469.  
  470. Downloaded from central: https://repo.maven.apache.org/maven2/org/apache/maven/maven-settings/2.0.6/maven-settings-2.0.6.pom (2.0 kB at 3.3 kB/s)
  471. Downloading from central: https://repo.maven.apache.org/maven2/org/apache/maven/maven-model/2.0.6/maven-model-2.0.6.pom
  472. Progress (1): 3.0 kB
  473.  
  474. Downloaded from central: https://repo.maven.apache.org/maven2/org/apache/maven/maven-model/2.0.6/maven-model-2.0.6.pom (3.0 kB at 3.4 kB/s)
  475. Downloading from central: https://repo.maven.apache.org/maven2/org/codehaus/plexus/plexus-utils/1.4.1/plexus-utils-1.4.1.pom
  476. Progress (1): 1.9 kB
  477.  
  478. Downloaded from central: https://repo.maven.apache.org/maven2/org/codehaus/plexus/plexus-utils/1.4.1/plexus-utils-1.4.1.pom (1.9 kB at 2.1 kB/s)
  479. Downloading from central: https://repo.maven.apache.org/maven2/org/codehaus/plexus/plexus/1.0.11/plexus-1.0.11.pom
  480. Progress (1): 4.1/9.0 kB
  481. Progress (1): 8.2/9.0 kB
  482. Progress (1): 9.0 kB
  483.  
  484. Downloaded from central: https://repo.maven.apache.org/maven2/org/codehaus/plexus/plexus/1.0.11/plexus-1.0.11.pom (9.0 kB at 9.9 kB/s)
  485. Downloading from central: https://repo.maven.apache.org/maven2/org/codehaus/plexus/plexus-container-default/1.0-alpha-9-stable-1/plexus-container-default-1.0-alpha-9-stable-1.pom
  486. Progress (1): 3.9 kB
  487.  
  488. Downloaded from central: https://repo.maven.apache.org/maven2/org/codehaus/plexus/plexus-container-default/1.0-alpha-9-stable-1/plexus-container-default-1.0-alpha-9-stable-1.pom (3.9 kB at 6.6 kB/s)
  489. Downloading from central: https://repo.maven.apache.org/maven2/org/codehaus/plexus/plexus-containers/1.0.3/plexus-containers-1.0.3.pom
  490. Progress (1): 492 B
  491.  
  492. Downloaded from central: https://repo.maven.apache.org/maven2/org/codehaus/plexus/plexus-containers/1.0.3/plexus-containers-1.0.3.pom (492 B at 403 B/s)
  493. Downloading from central: https://repo.maven.apache.org/maven2/org/codehaus/plexus/plexus/1.0.4/plexus-1.0.4.pom
  494. Progress (1): 4.1/5.7 kB
  495. Progress (1): 5.7 kB
  496.  
  497. Downloaded from central: https://repo.maven.apache.org/maven2/org/codehaus/plexus/plexus/1.0.4/plexus-1.0.4.pom (5.7 kB at 6.1 kB/s)
  498. Downloading from central: https://repo.maven.apache.org/maven2/junit/junit/3.8.1/junit-3.8.1.pom
  499. Progress (1): 998 B
  500.  
  501. Downloaded from central: https://repo.maven.apache.org/maven2/junit/junit/3.8.1/junit-3.8.1.pom (998 B at 841 B/s)
  502. Downloading from central: https://repo.maven.apache.org/maven2/org/codehaus/plexus/plexus-utils/1.0.4/plexus-utils-1.0.4.pom
  503. Progress (1): 4.1/6.9 kB
  504. Progress (1): 6.9 kB
  505.  
  506. Downloaded from central: https://repo.maven.apache.org/maven2/org/codehaus/plexus/plexus-utils/1.0.4/plexus-utils-1.0.4.pom (6.9 kB at 7.5 kB/s)
  507. Downloading from central: https://repo.maven.apache.org/maven2/classworlds/classworlds/1.1-alpha-2/classworlds-1.1-alpha-2.pom
  508. Progress (1): 3.1 kB
  509.  
  510. Downloaded from central: https://repo.maven.apache.org/maven2/classworlds/classworlds/1.1-alpha-2/classworlds-1.1-alpha-2.pom (3.1 kB at 3.6 kB/s)
  511. Downloading from central: https://repo.maven.apache.org/maven2/org/apache/maven/maven-profile/2.0.6/maven-profile-2.0.6.pom
  512. Progress (1): 2.0 kB
  513.  
  514. Downloaded from central: https://repo.maven.apache.org/maven2/org/apache/maven/maven-profile/2.0.6/maven-profile-2.0.6.pom (2.0 kB at 3.3 kB/s)
  515. Downloading from central: https://repo.maven.apache.org/maven2/org/apache/maven/maven-artifact-manager/2.0.6/maven-artifact-manager-2.0.6.pom
  516. Progress (1): 2.6 kB
  517.  
  518. Downloaded from central: https://repo.maven.apache.org/maven2/org/apache/maven/maven-artifact-manager/2.0.6/maven-artifact-manager-2.0.6.pom (2.6 kB at 4.4 kB/s)
  519. Downloading from central: https://repo.maven.apache.org/maven2/org/apache/maven/maven-repository-metadata/2.0.6/maven-repository-metadata-2.0.6.pom
  520. Progress (1): 1.9 kB
  521.  
  522. Downloaded from central: https://repo.maven.apache.org/maven2/org/apache/maven/maven-repository-metadata/2.0.6/maven-repository-metadata-2.0.6.pom (1.9 kB at 1.5 kB/s)
  523. Downloading from central: https://repo.maven.apache.org/maven2/org/apache/maven/maven-artifact/2.0.6/maven-artifact-2.0.6.pom
  524. Progress (1): 1.6 kB
  525.  
  526. Downloaded from central: https://repo.maven.apache.org/maven2/org/apache/maven/maven-artifact/2.0.6/maven-artifact-2.0.6.pom (1.6 kB at 1.8 kB/s)
  527. Downloading from central: https://repo.maven.apache.org/maven2/org/apache/maven/maven-plugin-registry/2.0.6/maven-plugin-registry-2.0.6.pom
  528. Progress (1): 1.9 kB
  529.  
  530. Downloaded from central: https://repo.maven.apache.org/maven2/org/apache/maven/maven-plugin-registry/2.0.6/maven-plugin-registry-2.0.6.pom (1.9 kB at 2.4 kB/s)
  531. Downloading from central: https://repo.maven.apache.org/maven2/org/apache/maven/maven-core/2.0.6/maven-core-2.0.6.pom
  532. Progress (1): 4.1/6.7 kB
  533. Progress (1): 6.7 kB
  534.  
  535. Downloaded from central: https://repo.maven.apache.org/maven2/org/apache/maven/maven-core/2.0.6/maven-core-2.0.6.pom (6.7 kB at 9.5 kB/s)
  536. Downloading from central: https://repo.maven.apache.org/maven2/org/apache/maven/maven-plugin-parameter-documenter/2.0.6/maven-plugin-parameter-documenter-2.0.6.pom
  537. Progress (1): 1.9 kB
  538.  
  539. Downloaded from central: https://repo.maven.apache.org/maven2/org/apache/maven/maven-plugin-parameter-documenter/2.0.6/maven-plugin-parameter-documenter-2.0.6.pom (1.9 kB at 2.0 kB/s)
  540. Downloading from central: https://repo.maven.apache.org/maven2/org/apache/maven/reporting/maven-reporting-api/2.0.6/maven-reporting-api-2.0.6.pom
  541. Progress (1): 1.8 kB
  542.  
  543. Downloaded from central: https://repo.maven.apache.org/maven2/org/apache/maven/reporting/maven-reporting-api/2.0.6/maven-reporting-api-2.0.6.pom (1.8 kB at 1.6 kB/s)
  544. Downloading from central: https://repo.maven.apache.org/maven2/org/apache/maven/reporting/maven-reporting/2.0.6/maven-reporting-2.0.6.pom
  545. Progress (1): 1.4 kB
  546.  
  547. Downloaded from central: https://repo.maven.apache.org/maven2/org/apache/maven/reporting/maven-reporting/2.0.6/maven-reporting-2.0.6.pom (1.4 kB at 1.2 kB/s)
  548. Downloading from central: https://repo.maven.apache.org/maven2/org/apache/maven/doxia/doxia-sink-api/1.0-alpha-7/doxia-sink-api-1.0-alpha-7.pom
  549. Progress (1): 424 B
  550.  
  551. Downloaded from central: https://repo.maven.apache.org/maven2/org/apache/maven/doxia/doxia-sink-api/1.0-alpha-7/doxia-sink-api-1.0-alpha-7.pom (424 B at 462 B/s)
  552. Downloading from central: https://repo.maven.apache.org/maven2/org/apache/maven/doxia/doxia/1.0-alpha-7/doxia-1.0-alpha-7.pom
  553. Progress (1): 3.9 kB
  554.  
  555. Downloaded from central: https://repo.maven.apache.org/maven2/org/apache/maven/doxia/doxia/1.0-alpha-7/doxia-1.0-alpha-7.pom (3.9 kB at 3.3 kB/s)
  556. Downloading from central: https://repo.maven.apache.org/maven2/org/apache/maven/maven-error-diagnostics/2.0.6/maven-error-diagnostics-2.0.6.pom
  557. Progress (1): 1.7 kB
  558.  
  559. Downloaded from central: https://repo.maven.apache.org/maven2/org/apache/maven/maven-error-diagnostics/2.0.6/maven-error-diagnostics-2.0.6.pom (1.7 kB at 1.9 kB/s)
  560. Downloading from central: https://repo.maven.apache.org/maven2/commons-cli/commons-cli/1.0/commons-cli-1.0.pom
  561. Progress (1): 2.1 kB
  562.  
  563. Downloaded from central: https://repo.maven.apache.org/maven2/commons-cli/commons-cli/1.0/commons-cli-1.0.pom (2.1 kB at 2.3 kB/s)
  564. Downloading from central: https://repo.maven.apache.org/maven2/org/apache/maven/maven-plugin-descriptor/2.0.6/maven-plugin-descriptor-2.0.6.pom
  565. Progress (1): 2.0 kB
  566.  
  567. Downloaded from central: https://repo.maven.apache.org/maven2/org/apache/maven/maven-plugin-descriptor/2.0.6/maven-plugin-descriptor-2.0.6.pom (2.0 kB at 1.7 kB/s)
  568. Downloading from central: https://repo.maven.apache.org/maven2/org/codehaus/plexus/plexus-interactivity-api/1.0-alpha-4/plexus-interactivity-api-1.0-alpha-4.pom
  569. Progress (1): 4.1/7.1 kB
  570. Progress (1): 7.1 kB
  571.  
  572. Downloaded from central: https://repo.maven.apache.org/maven2/org/codehaus/plexus/plexus-interactivity-api/1.0-alpha-4/plexus-interactivity-api-1.0-alpha-4.pom (7.1 kB at 8.2 kB/s)
  573. Downloading from central: https://repo.maven.apache.org/maven2/org/apache/maven/maven-monitor/2.0.6/maven-monitor-2.0.6.pom
  574. Progress (1): 1.3 kB
  575.  
  576. Downloaded from central: https://repo.maven.apache.org/maven2/org/apache/maven/maven-monitor/2.0.6/maven-monitor-2.0.6.pom (1.3 kB at 1.4 kB/s)
  577. Downloading from central: https://repo.maven.apache.org/maven2/classworlds/classworlds/1.1/classworlds-1.1.pom
  578. Progress (1): 3.3 kB
  579.  
  580. Downloaded from central: https://repo.maven.apache.org/maven2/classworlds/classworlds/1.1/classworlds-1.1.pom (3.3 kB at 5.6 kB/s)
  581. Downloading from central: https://repo.maven.apache.org/maven2/org/codehaus/plexus/plexus-utils/2.0.5/plexus-utils-2.0.5.pom
  582. Progress (1): 3.3 kB
  583.  
  584. Downloaded from central: https://repo.maven.apache.org/maven2/org/codehaus/plexus/plexus-utils/2.0.5/plexus-utils-2.0.5.pom (3.3 kB at 3.7 kB/s)
  585. Downloading from central: https://repo.maven.apache.org/maven2/org/codehaus/plexus/plexus/2.0.6/plexus-2.0.6.pom
  586. Progress (1): 4.1/17 kB
  587. Progress (1): 8.2/17 kB
  588. Progress (1): 12/17 kB
  589. Progress (1): 16/17 kB
  590. Progress (1): 17 kB
  591.  
  592. Downloaded from central: https://repo.maven.apache.org/maven2/org/codehaus/plexus/plexus/2.0.6/plexus-2.0.6.pom (17 kB at 14 kB/s)
  593. Downloading from central: https://repo.maven.apache.org/maven2/org/apache/maven/shared/maven-filtering/1.1/maven-filtering-1.1.pom
  594. Progress (1): 4.1/5.8 kB
  595. Progress (1): 5.8 kB
  596.  
  597. Downloaded from central: https://repo.maven.apache.org/maven2/org/apache/maven/shared/maven-filtering/1.1/maven-filtering-1.1.pom (5.8 kB at 6.4 kB/s)
  598. Downloading from central: https://repo.maven.apache.org/maven2/org/apache/maven/shared/maven-shared-components/17/maven-shared-components-17.pom
  599. Progress (1): 4.1/8.7 kB
  600. Progress (1): 8.2/8.7 kB
  601. Progress (1): 8.7 kB
  602.  
  603. Downloaded from central: https://repo.maven.apache.org/maven2/org/apache/maven/shared/maven-shared-components/17/maven-shared-components-17.pom (8.7 kB at 9.5 kB/s)
  604. Downloading from central: https://repo.maven.apache.org/maven2/org/codehaus/plexus/plexus-utils/1.5.15/plexus-utils-1.5.15.pom
  605. Progress (1): 4.1/6.8 kB
  606. Progress (1): 6.8 kB
  607.  
  608. Downloaded from central: https://repo.maven.apache.org/maven2/org/codehaus/plexus/plexus-utils/1.5.15/plexus-utils-1.5.15.pom (6.8 kB at 7.9 kB/s)
  609. Downloading from central: https://repo.maven.apache.org/maven2/org/codehaus/plexus/plexus/2.0.2/plexus-2.0.2.pom
  610. Progress (1): 4.1/12 kB
  611. Progress (1): 8.2/12 kB
  612. Progress (1): 12 kB
  613.  
  614. Downloaded from central: https://repo.maven.apache.org/maven2/org/codehaus/plexus/plexus/2.0.2/plexus-2.0.2.pom (12 kB at 18 kB/s)
  615. Downloading from central: https://repo.maven.apache.org/maven2/org/codehaus/plexus/plexus-interpolation/1.12/plexus-interpolation-1.12.pom
  616. Progress (1): 889 B
  617.  
  618. Downloaded from central: https://repo.maven.apache.org/maven2/org/codehaus/plexus/plexus-interpolation/1.12/plexus-interpolation-1.12.pom (889 B at 980 B/s)
  619. Downloading from central: https://repo.maven.apache.org/maven2/org/codehaus/plexus/plexus-components/1.1.14/plexus-components-1.1.14.pom
  620. Progress (1): 4.1/5.8 kB
  621. Progress (1): 5.8 kB
  622.  
  623. Downloaded from central: https://repo.maven.apache.org/maven2/org/codehaus/plexus/plexus-components/1.1.14/plexus-components-1.1.14.pom (5.8 kB at 9.6 kB/s)
  624. Downloading from central: https://repo.maven.apache.org/maven2/org/sonatype/plexus/plexus-build-api/0.0.4/plexus-build-api-0.0.4.pom
  625. Progress (1): 2.9 kB
  626.  
  627. Downloaded from central: https://repo.maven.apache.org/maven2/org/sonatype/plexus/plexus-build-api/0.0.4/plexus-build-api-0.0.4.pom (2.9 kB at 3.3 kB/s)
  628. Downloading from central: https://repo.maven.apache.org/maven2/org/sonatype/spice/spice-parent/10/spice-parent-10.pom
  629. Progress (1): 3.0 kB
  630.  
  631. Downloaded from central: https://repo.maven.apache.org/maven2/org/sonatype/spice/spice-parent/10/spice-parent-10.pom (3.0 kB at 3.3 kB/s)
  632. Downloading from central: https://repo.maven.apache.org/maven2/org/sonatype/forge/forge-parent/3/forge-parent-3.pom
  633. Progress (1): 4.1/5.0 kB
  634. Progress (1): 5.0 kB
  635.  
  636. Downloaded from central: https://repo.maven.apache.org/maven2/org/sonatype/forge/forge-parent/3/forge-parent-3.pom (5.0 kB at 8.3 kB/s)
  637. Downloading from central: https://repo.maven.apache.org/maven2/org/codehaus/plexus/plexus-utils/1.5.8/plexus-utils-1.5.8.pom
  638. Progress (1): 4.1/8.1 kB
  639. Progress (1): 8.1 kB
  640.  
  641. Downloaded from central: https://repo.maven.apache.org/maven2/org/codehaus/plexus/plexus-utils/1.5.8/plexus-utils-1.5.8.pom (8.1 kB at 14 kB/s)
  642. Downloading from central: https://repo.maven.apache.org/maven2/org/codehaus/plexus/plexus-interpolation/1.13/plexus-interpolation-1.13.pom
  643. Progress (1): 890 B
  644.  
  645. Downloaded from central: https://repo.maven.apache.org/maven2/org/codehaus/plexus/plexus-interpolation/1.13/plexus-interpolation-1.13.pom (890 B at 1.4 kB/s)
  646. Downloading from central: https://repo.maven.apache.org/maven2/org/codehaus/plexus/plexus-components/1.1.15/plexus-components-1.1.15.pom
  647. Progress (1): 2.8 kB
  648.  
  649. Downloaded from central: https://repo.maven.apache.org/maven2/org/codehaus/plexus/plexus-components/1.1.15/plexus-components-1.1.15.pom (2.8 kB at 2.3 kB/s)
  650. Downloading from central: https://repo.maven.apache.org/maven2/org/codehaus/plexus/plexus/2.0.3/plexus-2.0.3.pom
  651. Progress (1): 4.1/15 kB
  652. Progress (1): 8.2/15 kB
  653. Progress (1): 12/15 kB
  654. Progress (1): 15 kB
  655.  
  656. Downloaded from central: https://repo.maven.apache.org/maven2/org/codehaus/plexus/plexus/2.0.3/plexus-2.0.3.pom (15 kB at 17 kB/s)
  657. Downloading from central: https://repo.maven.apache.org/maven2/org/apache/maven/maven-project/2.0.6/maven-project-2.0.6.jar
  658. Downloading from central: https://repo.maven.apache.org/maven2/org/apache/maven/maven-profile/2.0.6/maven-profile-2.0.6.jar
  659. Downloading from central: https://repo.maven.apache.org/maven2/org/apache/maven/maven-artifact-manager/2.0.6/maven-artifact-manager-2.0.6.jar
  660. Downloading from central: https://repo.maven.apache.org/maven2/org/apache/maven/maven-plugin-registry/2.0.6/maven-plugin-registry-2.0.6.jar
  661. Downloading from central: https://repo.maven.apache.org/maven2/org/apache/maven/maven-core/2.0.6/maven-core-2.0.6.jar
  662. Progress (1): 4.1/116 kB
  663. Progress (1): 8.2/116 kB
  664. Progress (1): 12/116 kB
  665. Progress (1): 16/116 kB
  666. Progress (2): 16/116 kB | 2.7/29 kB
  667. Progress (2): 20/116 kB | 2.7/29 kB
  668. Progress (2): 25/116 kB | 2.7/29 kB
  669. Progress (2): 29/116 kB | 2.7/29 kB
  670. Progress (2): 33/116 kB | 2.7/29 kB
  671. Progress (2): 33/116 kB | 5.5/29 kB
  672. Progress (2): 33/116 kB | 8.2/29 kB
  673. Progress (2): 33/116 kB | 11/29 kB
  674. Progress (2): 33/116 kB | 14/29 kB
  675. Progress (2): 33/116 kB | 16/29 kB
  676. Progress (2): 33/116 kB | 19/29 kB
  677. Progress (2): 33/116 kB | 22/29 kB
  678. Progress (2): 33/116 kB | 25/29 kB
  679. Progress (2): 33/116 kB | 27/29 kB
  680. Progress (2): 33/116 kB | 29 kB
  681. Progress (2): 37/116 kB | 29 kB
  682. Progress (2): 41/116 kB | 29 kB
  683. Progress (2): 45/116 kB | 29 kB
  684. Progress (2): 49/116 kB | 29 kB
  685. Progress (2): 53/116 kB | 29 kB
  686. Progress (2): 57/116 kB | 29 kB
  687. Progress (2): 61/116 kB | 29 kB
  688. Progress (2): 66/116 kB | 29 kB
  689.  
  690. Downloaded from central: https://repo.maven.apache.org/maven2/org/apache/maven/maven-plugin-registry/2.0.6/maven-plugin-registry-2.0.6.jar (29 kB at 32 kB/s)
  691. Downloading from central: https://repo.maven.apache.org/maven2/org/apache/maven/maven-plugin-parameter-documenter/2.0.6/maven-plugin-parameter-documenter-2.0.6.jar
  692. Progress (1): 70/116 kB
  693. Progress (1): 74/116 kB
  694. Progress (1): 78/116 kB
  695. Progress (1): 82/116 kB
  696. Progress (1): 86/116 kB
  697. Progress (1): 90/116 kB
  698. Progress (1): 94/116 kB
  699. Progress (1): 98/116 kB
  700. Progress (2): 98/116 kB | 2.7/21 kB
  701. Progress (2): 98/116 kB | 5.5/21 kB
  702. Progress (2): 98/116 kB | 8.2/21 kB
  703. Progress (2): 98/116 kB | 11/21 kB
  704. Progress (2): 98/116 kB | 14/21 kB
  705. Progress (2): 98/116 kB | 16/21 kB
  706. Progress (2): 98/116 kB | 19/21 kB
  707. Progress (2): 98/116 kB | 21 kB
  708. Progress (2): 102/116 kB | 21 kB
  709. Progress (2): 106/116 kB | 21 kB
  710. Progress (2): 111/116 kB | 21 kB
  711. Progress (2): 115/116 kB | 21 kB
  712. Progress (2): 116 kB | 21 kB
  713.  
  714. Downloaded from central: https://repo.maven.apache.org/maven2/org/apache/maven/maven-plugin-parameter-documenter/2.0.6/maven-plugin-parameter-documenter-2.0.6.jar (21 kB at 16 kB/s)
  715. Downloading from central: https://repo.maven.apache.org/maven2/org/apache/maven/reporting/maven-reporting-api/2.0.6/maven-reporting-api-2.0.6.jar
  716. Progress (2): 116 kB | 2.7/9.9 kB
  717. Progress (2): 116 kB | 5.5/9.9 kB
  718.  
  719. Downloaded from central: https://repo.maven.apache.org/maven2/org/apache/maven/maven-project/2.0.6/maven-project-2.0.6.jar (116 kB at 64 kB/s)
  720. Progress (1): 8.2/9.9 kB
  721.  
  722. Downloading from central: https://repo.maven.apache.org/maven2/org/apache/maven/doxia/doxia-sink-api/1.0-alpha-7/doxia-sink-api-1.0-alpha-7.jar
  723. Progress (1): 9.9 kB
  724. Progress (2): 9.9 kB | 2.7/35 kB
  725. Progress (3): 9.9 kB | 2.7/35 kB | 2.7/57 kB
  726. Progress (3): 9.9 kB | 2.7/35 kB | 5.5/57 kB
  727. Progress (3): 9.9 kB | 2.7/35 kB | 8.2/57 kB
  728. Progress (3): 9.9 kB | 5.5/35 kB | 8.2/57 kB
  729. Progress (4): 9.9 kB | 5.5/35 kB | 8.2/57 kB | 2.7/5.9 kB
  730. Progress (4): 9.9 kB | 8.2/35 kB | 8.2/57 kB | 2.7/5.9 kB
  731. Progress (4): 9.9 kB | 8.2/35 kB | 11/57 kB | 2.7/5.9 kB
  732.  
  733. Downloaded from central: https://repo.maven.apache.org/maven2/org/apache/maven/reporting/maven-reporting-api/2.0.6/maven-reporting-api-2.0.6.jar (9.9 kB at 4.1 kB/s)
  734. Downloading from central: https://repo.maven.apache.org/maven2/org/apache/maven/maven-repository-metadata/2.0.6/maven-repository-metadata-2.0.6.jar
  735. Progress (3): 11/35 kB | 11/57 kB | 2.7/5.9 kB
  736. Progress (3): 11/35 kB | 11/57 kB | 5.5/5.9 kB
  737. Progress (3): 11/35 kB | 11/57 kB | 5.9 kB
  738. Progress (4): 11/35 kB | 11/57 kB | 5.9 kB | 2.7/152 kB
  739. Progress (4): 11/35 kB | 11/57 kB | 5.9 kB | 5.5/152 kB
  740. Progress (4): 11/35 kB | 11/57 kB | 5.9 kB | 8.2/152 kB
  741. Progress (4): 11/35 kB | 11/57 kB | 5.9 kB | 11/152 kB
  742. Progress (4): 11/35 kB | 11/57 kB | 5.9 kB | 14/152 kB
  743. Progress (4): 11/35 kB | 11/57 kB | 5.9 kB | 16/152 kB
  744. Progress (4): 11/35 kB | 14/57 kB | 5.9 kB | 16/152 kB
  745. Progress (4): 11/35 kB | 16/57 kB | 5.9 kB | 16/152 kB
  746. Progress (4): 11/35 kB | 16/57 kB | 5.9 kB | 19/152 kB
  747. Progress (4): 11/35 kB | 19/57 kB | 5.9 kB | 19/152 kB
  748. Progress (4): 14/35 kB | 19/57 kB | 5.9 kB | 19/152 kB
  749. Progress (4): 16/35 kB | 19/57 kB | 5.9 kB | 19/152 kB
  750. Progress (4): 19/35 kB | 19/57 kB | 5.9 kB | 19/152 kB
  751. Progress (4): 22/35 kB | 19/57 kB | 5.9 kB | 19/152 kB
  752. Progress (4): 25/35 kB | 19/57 kB | 5.9 kB | 19/152 kB
  753. Progress (4): 27/35 kB | 19/57 kB | 5.9 kB | 19/152 kB
  754. Progress (4): 30/35 kB | 19/57 kB | 5.9 kB | 19/152 kB
  755. Progress (4): 33/35 kB | 19/57 kB | 5.9 kB | 19/152 kB
  756. Progress (4): 35 kB | 19/57 kB | 5.9 kB | 19/152 kB
  757. Progress (5): 35 kB | 19/57 kB | 5.9 kB | 19/152 kB | 4.1/24 kB
  758. Progress (5): 35 kB | 19/57 kB | 5.9 kB | 19/152 kB | 8.2/24 kB
  759. Progress (5): 35 kB | 19/57 kB | 5.9 kB | 19/152 kB | 12/24 kB
  760. Progress (5): 35 kB | 19/57 kB | 5.9 kB | 19/152 kB | 16/24 kB
  761. Progress (5): 35 kB | 19/57 kB | 5.9 kB | 19/152 kB | 20/24 kB
  762. Progress (5): 35 kB | 19/57 kB | 5.9 kB | 19/152 kB | 24 kB
  763.  
  764. Downloaded from central: https://repo.maven.apache.org/maven2/org/apache/maven/doxia/doxia-sink-api/1.0-alpha-7/doxia-sink-api-1.0-alpha-7.jar (5.9 kB at 2.2 kB/s)
  765. Downloading from central: https://repo.maven.apache.org/maven2/org/apache/maven/maven-error-diagnostics/2.0.6/maven-error-diagnostics-2.0.6.jar
  766. Progress (4): 35 kB | 22/57 kB | 19/152 kB | 24 kB
  767. Progress (4): 35 kB | 22/57 kB | 22/152 kB | 24 kB
  768. Progress (4): 35 kB | 22/57 kB | 25/152 kB | 24 kB
  769. Progress (4): 35 kB | 25/57 kB | 25/152 kB | 24 kB
  770. Progress (4): 35 kB | 25/57 kB | 27/152 kB | 24 kB
  771. Progress (4): 35 kB | 27/57 kB | 27/152 kB | 24 kB
  772. Progress (4): 35 kB | 30/57 kB | 27/152 kB | 24 kB
  773. Progress (5): 35 kB | 30/57 kB | 27/152 kB | 24 kB | 2.7/14 kB
  774.  
  775. Downloaded from central: https://repo.maven.apache.org/maven2/org/apache/maven/maven-profile/2.0.6/maven-profile-2.0.6.jar (35 kB at 11 kB/s)
  776. Progress (4): 30/57 kB | 27/152 kB | 24 kB | 5.5/14 kB
  777. Progress (4): 30/57 kB | 27/152 kB | 24 kB | 8.2/14 kB
  778. Progress (4): 30/57 kB | 27/152 kB | 24 kB | 11/14 kB
  779. Progress (4): 30/57 kB | 27/152 kB | 24 kB | 14 kB
  780.  
  781. Downloading from central: https://repo.maven.apache.org/maven2/commons-cli/commons-cli/1.0/commons-cli-1.0.jar
  782. Downloaded from central: https://repo.maven.apache.org/maven2/org/apache/maven/maven-repository-metadata/2.0.6/maven-repository-metadata-2.0.6.jar (24 kB at 7.8 kB/s)
  783. Downloading from central: https://repo.maven.apache.org/maven2/org/apache/maven/maven-plugin-descriptor/2.0.6/maven-plugin-descriptor-2.0.6.jar
  784. Progress (3): 30/57 kB | 30/152 kB | 14 kB
  785. Progress (3): 30/57 kB | 33/152 kB | 14 kB
  786. Progress (3): 33/57 kB | 33/152 kB | 14 kB
  787. Progress (3): 33/57 kB | 36/152 kB | 14 kB
  788. Progress (3): 36/57 kB | 36/152 kB | 14 kB
  789. Progress (3): 36/57 kB | 38/152 kB | 14 kB
  790. Progress (3): 38/57 kB | 38/152 kB | 14 kB
  791. Progress (3): 38/57 kB | 41/152 kB | 14 kB
  792. Progress (3): 41/57 kB | 41/152 kB | 14 kB
  793. Progress (3): 44/57 kB | 41/152 kB | 14 kB
  794. Progress (4): 44/57 kB | 41/152 kB | 14 kB | 4.1/30 kB
  795. Progress (4): 44/57 kB | 41/152 kB | 14 kB | 8.2/30 kB
  796. Progress (4): 44/57 kB | 41/152 kB | 14 kB | 12/30 kB
  797. Progress (4): 47/57 kB | 41/152 kB | 14 kB | 12/30 kB
  798. Progress (4): 47/57 kB | 41/152 kB | 14 kB | 16/30 kB
  799. Progress (5): 47/57 kB | 41/152 kB | 14 kB | 16/30 kB | 2.7/37 kB
  800. Progress (5): 47/57 kB | 41/152 kB | 14 kB | 20/30 kB | 2.7/37 kB
  801. Progress (5): 49/57 kB | 41/152 kB | 14 kB | 20/30 kB | 2.7/37 kB
  802. Progress (5): 49/57 kB | 41/152 kB | 14 kB | 25/30 kB | 2.7/37 kB
  803. Progress (5): 49/57 kB | 41/152 kB | 14 kB | 25/30 kB | 5.5/37 kB
  804. Progress (5): 49/57 kB | 41/152 kB | 14 kB | 29/30 kB | 5.5/37 kB
  805. Progress (5): 49/57 kB | 41/152 kB | 14 kB | 29/30 kB | 8.2/37 kB
  806. Progress (5): 52/57 kB | 41/152 kB | 14 kB | 29/30 kB | 8.2/37 kB
  807. Progress (5): 52/57 kB | 41/152 kB | 14 kB | 30 kB | 8.2/37 kB
  808. Progress (5): 52/57 kB | 41/152 kB | 14 kB | 30 kB | 11/37 kB
  809. Progress (5): 55/57 kB | 41/152 kB | 14 kB | 30 kB | 11/37 kB
  810. Progress (5): 55/57 kB | 41/152 kB | 14 kB | 30 kB | 14/37 kB
  811.  
  812. Downloaded from central: https://repo.maven.apache.org/maven2/org/apache/maven/maven-error-diagnostics/2.0.6/maven-error-diagnostics-2.0.6.jar (14 kB at 3.9 kB/s)
  813. Downloading from central: https://repo.maven.apache.org/maven2/org/codehaus/plexus/plexus-interactivity-api/1.0-alpha-4/plexus-interactivity-api-1.0-alpha-4.jar
  814. Progress (4): 57 kB | 41/152 kB | 30 kB | 14/37 kB
  815. Progress (4): 57 kB | 41/152 kB | 30 kB | 16/37 kB
  816. Progress (4): 57 kB | 41/152 kB | 30 kB | 19/37 kB
  817. Progress (4): 57 kB | 41/152 kB | 30 kB | 22/37 kB
  818. Progress (4): 57 kB | 41/152 kB | 30 kB | 25/37 kB
  819. Progress (4): 57 kB | 41/152 kB | 30 kB | 27/37 kB
  820. Progress (4): 57 kB | 41/152 kB | 30 kB | 30/37 kB
  821. Progress (4): 57 kB | 41/152 kB | 30 kB | 33/37 kB
  822. Progress (4): 57 kB | 41/152 kB | 30 kB | 36/37 kB
  823. Progress (4): 57 kB | 41/152 kB | 30 kB | 37 kB
  824. Progress (4): 57 kB | 44/152 kB | 30 kB | 37 kB
  825. Progress (4): 57 kB | 47/152 kB | 30 kB | 37 kB
  826. Progress (4): 57 kB | 49/152 kB | 30 kB | 37 kB
  827. Progress (4): 57 kB | 52/152 kB | 30 kB | 37 kB
  828. Progress (4): 57 kB | 55/152 kB | 30 kB | 37 kB
  829.  
  830. Downloaded from central: https://repo.maven.apache.org/maven2/commons-cli/commons-cli/1.0/commons-cli-1.0.jar (30 kB at 7.9 kB/s)
  831. Progress (4): 57 kB | 55/152 kB | 37 kB | 2.7/13 kB
  832.  
  833. Downloaded from central: https://repo.maven.apache.org/maven2/org/apache/maven/maven-artifact-manager/2.0.6/maven-artifact-manager-2.0.6.jar (57 kB at 14 kB/s)
  834. Downloading from central: https://repo.maven.apache.org/maven2/org/apache/maven/maven-artifact/2.0.6/maven-artifact-2.0.6.jar
  835. Downloading from central: https://repo.maven.apache.org/maven2/classworlds/classworlds/1.1/classworlds-1.1.jar
  836. Downloaded from central: https://repo.maven.apache.org/maven2/org/apache/maven/maven-plugin-descriptor/2.0.6/maven-plugin-descriptor-2.0.6.jar (37 kB at 9.7 kB/s)
  837. Downloading from central: https://repo.maven.apache.org/maven2/org/apache/maven/maven-settings/2.0.6/maven-settings-2.0.6.jar
  838. Progress (2): 55/152 kB | 5.5/13 kB
  839. Progress (2): 55/152 kB | 8.2/13 kB
  840. Progress (2): 55/152 kB | 11/13 kB
  841. Progress (2): 55/152 kB | 13 kB
  842. Progress (2): 58/152 kB | 13 kB
  843. Progress (2): 60/152 kB | 13 kB
  844. Progress (2): 63/152 kB | 13 kB
  845. Progress (2): 66/152 kB | 13 kB
  846. Progress (3): 66/152 kB | 13 kB | 2.7/87 kB
  847. Progress (3): 66/152 kB | 13 kB | 5.5/87 kB
  848. Progress (3): 66/152 kB | 13 kB | 8.2/87 kB
  849. Progress (3): 66/152 kB | 13 kB | 11/87 kB
  850. Progress (3): 66/152 kB | 13 kB | 14/87 kB
  851. Progress (3): 66/152 kB | 13 kB | 16/87 kB
  852. Progress (3): 66/152 kB | 13 kB | 19/87 kB
  853. Progress (3): 66/152 kB | 13 kB | 22/87 kB
  854. Progress (3): 66/152 kB | 13 kB | 25/87 kB
  855. Progress (3): 66/152 kB | 13 kB | 27/87 kB
  856. Progress (3): 66/152 kB | 13 kB | 30/87 kB
  857. Progress (3): 66/152 kB | 13 kB | 33/87 kB
  858. Progress (3): 66/152 kB | 13 kB | 36/87 kB
  859. Progress (3): 66/152 kB | 13 kB | 38/87 kB
  860. Progress (3): 66/152 kB | 13 kB | 41/87 kB
  861. Progress (3): 66/152 kB | 13 kB | 44/87 kB
  862. Progress (3): 66/152 kB | 13 kB | 47/87 kB
  863. Progress (3): 66/152 kB | 13 kB | 49/87 kB
  864. Progress (3): 66/152 kB | 13 kB | 52/87 kB
  865. Progress (4): 66/152 kB | 13 kB | 52/87 kB | 2.7/49 kB
  866. Progress (4): 66/152 kB | 13 kB | 52/87 kB | 5.5/49 kB
  867. Progress (4): 66/152 kB | 13 kB | 52/87 kB | 8.2/49 kB
  868. Progress (4): 66/152 kB | 13 kB | 52/87 kB | 11/49 kB
  869. Progress (4): 66/152 kB | 13 kB | 52/87 kB | 14/49 kB
  870. Progress (4): 66/152 kB | 13 kB | 52/87 kB | 16/49 kB
  871. Progress (4): 66/152 kB | 13 kB | 52/87 kB | 19/49 kB
  872. Progress (4): 66/152 kB | 13 kB | 52/87 kB | 22/49 kB
  873.  
  874. Downloaded from central: https://repo.maven.apache.org/maven2/org/codehaus/plexus/plexus-interactivity-api/1.0-alpha-4/plexus-interactivity-api-1.0-alpha-4.jar (13 kB at 3.2 kB/s)
  875. Downloading from central: https://repo.maven.apache.org/maven2/org/apache/maven/maven-model/2.0.6/maven-model-2.0.6.jar
  876. Progress (3): 66/152 kB | 52/87 kB | 25/49 kB
  877. Progress (3): 66/152 kB | 52/87 kB | 27/49 kB
  878. Progress (3): 66/152 kB | 52/87 kB | 30/49 kB
  879. Progress (3): 66/152 kB | 52/87 kB | 33/49 kB
  880. Progress (3): 66/152 kB | 52/87 kB | 36/49 kB
  881. Progress (3): 66/152 kB | 52/87 kB | 38/49 kB
  882. Progress (3): 69/152 kB | 52/87 kB | 38/49 kB
  883. Progress (3): 71/152 kB | 52/87 kB | 38/49 kB
  884. Progress (3): 74/152 kB | 52/87 kB | 38/49 kB
  885. Progress (3): 77/152 kB | 52/87 kB | 38/49 kB
  886. Progress (3): 77/152 kB | 55/87 kB | 38/49 kB
  887. Progress (3): 77/152 kB | 58/87 kB | 38/49 kB
  888. Progress (4): 77/152 kB | 58/87 kB | 38/49 kB | 4.1/38 kB
  889. Progress (4): 77/152 kB | 58/87 kB | 41/49 kB | 4.1/38 kB
  890. Progress (4): 77/152 kB | 58/87 kB | 41/49 kB | 8.2/38 kB
  891. Progress (4): 77/152 kB | 60/87 kB | 41/49 kB | 8.2/38 kB
  892. Progress (4): 77/152 kB | 60/87 kB | 41/49 kB | 12/38 kB
  893. Progress (4): 77/152 kB | 60/87 kB | 44/49 kB | 12/38 kB
  894. Progress (4): 77/152 kB | 60/87 kB | 44/49 kB | 16/38 kB
  895. Progress (4): 77/152 kB | 63/87 kB | 44/49 kB | 16/38 kB
  896. Progress (4): 77/152 kB | 63/87 kB | 47/49 kB | 16/38 kB
  897. Progress (4): 77/152 kB | 66/87 kB | 47/49 kB | 16/38 kB
  898. Progress (4): 77/152 kB | 66/87 kB | 47/49 kB | 20/38 kB
  899. Progress (4): 77/152 kB | 69/87 kB | 47/49 kB | 20/38 kB
  900. Progress (4): 77/152 kB | 69/87 kB | 49 kB | 20/38 kB
  901. Progress (4): 77/152 kB | 71/87 kB | 49 kB | 20/38 kB
  902. Progress (4): 77/152 kB | 71/87 kB | 49 kB | 25/38 kB
  903. Progress (4): 77/152 kB | 74/87 kB | 49 kB | 25/38 kB
  904. Progress (4): 77/152 kB | 74/87 kB | 49 kB | 29/38 kB
  905. Progress (4): 77/152 kB | 77/87 kB | 49 kB | 29/38 kB
  906. Progress (4): 77/152 kB | 77/87 kB | 49 kB | 33/38 kB
  907. Progress (4): 77/152 kB | 77/87 kB | 49 kB | 37/38 kB
  908. Progress (4): 77/152 kB | 80/87 kB | 49 kB | 37/38 kB
  909. Progress (4): 77/152 kB | 80/87 kB | 49 kB | 38 kB
  910. Progress (4): 77/152 kB | 82/87 kB | 49 kB | 38 kB
  911. Progress (4): 77/152 kB | 85/87 kB | 49 kB | 38 kB
  912. Progress (4): 77/152 kB | 87 kB | 49 kB | 38 kB
  913. Progress (5): 77/152 kB | 87 kB | 49 kB | 38 kB | 2.7/86 kB
  914. Progress (5): 77/152 kB | 87 kB | 49 kB | 38 kB | 5.5/86 kB
  915. Progress (5): 77/152 kB | 87 kB | 49 kB | 38 kB | 8.2/86 kB
  916. Progress (5): 77/152 kB | 87 kB | 49 kB | 38 kB | 11/86 kB
  917. Progress (5): 77/152 kB | 87 kB | 49 kB | 38 kB | 14/86 kB
  918. Progress (5): 77/152 kB | 87 kB | 49 kB | 38 kB | 16/86 kB
  919. Progress (5): 77/152 kB | 87 kB | 49 kB | 38 kB | 19/86 kB
  920. Progress (5): 77/152 kB | 87 kB | 49 kB | 38 kB | 22/86 kB
  921. Progress (5): 77/152 kB | 87 kB | 49 kB | 38 kB | 25/86 kB
  922. Progress (5): 77/152 kB | 87 kB | 49 kB | 38 kB | 27/86 kB
  923. Progress (5): 77/152 kB | 87 kB | 49 kB | 38 kB | 30/86 kB
  924. Progress (5): 77/152 kB | 87 kB | 49 kB | 38 kB | 33/86 kB
  925. Progress (5): 77/152 kB | 87 kB | 49 kB | 38 kB | 36/86 kB
  926. Progress (5): 77/152 kB | 87 kB | 49 kB | 38 kB | 38/86 kB
  927. Progress (5): 77/152 kB | 87 kB | 49 kB | 38 kB | 41/86 kB
  928. Progress (5): 80/152 kB | 87 kB | 49 kB | 38 kB | 41/86 kB
  929. Progress (5): 82/152 kB | 87 kB | 49 kB | 38 kB | 41/86 kB
  930. Progress (5): 82/152 kB | 87 kB | 49 kB | 38 kB | 44/86 kB
  931. Progress (5): 82/152 kB | 87 kB | 49 kB | 38 kB | 47/86 kB
  932. Progress (5): 82/152 kB | 87 kB | 49 kB | 38 kB | 49/86 kB
  933. Progress (5): 82/152 kB | 87 kB | 49 kB | 38 kB | 52/86 kB
  934. Progress (5): 82/152 kB | 87 kB | 49 kB | 38 kB | 55/86 kB
  935. Progress (5): 82/152 kB | 87 kB | 49 kB | 38 kB | 58/86 kB
  936. Progress (5): 82/152 kB | 87 kB | 49 kB | 38 kB | 60/86 kB
  937. Progress (5): 85/152 kB | 87 kB | 49 kB | 38 kB | 60/86 kB
  938. Progress (5): 85/152 kB | 87 kB | 49 kB | 38 kB | 63/86 kB
  939.  
  940. Downloaded from central: https://repo.maven.apache.org/maven2/org/apache/maven/maven-artifact/2.0.6/maven-artifact-2.0.6.jar (87 kB at 19 kB/s)
  941. Downloading from central: https://repo.maven.apache.org/maven2/org/apache/maven/maven-monitor/2.0.6/maven-monitor-2.0.6.jar
  942. Downloaded from central: https://repo.maven.apache.org/maven2/classworlds/classworlds/1.1/classworlds-1.1.jar (38 kB at 8.1 kB/s)
  943. Downloaded from central: https://repo.maven.apache.org/maven2/org/apache/maven/maven-settings/2.0.6/maven-settings-2.0.6.jar (49 kB at 10 kB/s)
  944. Downloading from central: https://repo.maven.apache.org/maven2/junit/junit/3.8.1/junit-3.8.1.jar
  945. Downloading from central: https://repo.maven.apache.org/maven2/org/codehaus/plexus/plexus-container-default/1.0-alpha-9-stable-1/plexus-container-default-1.0-alpha-9-stable-1.jar
  946. Progress (2): 85/152 kB | 66/86 kB
  947. Progress (2): 85/152 kB | 69/86 kB
  948. Progress (2): 85/152 kB | 71/86 kB
  949. Progress (2): 88/152 kB | 71/86 kB
  950. Progress (2): 90/152 kB | 71/86 kB
  951. Progress (2): 90/152 kB | 74/86 kB
  952. Progress (2): 93/152 kB | 74/86 kB
  953. Progress (2): 96/152 kB | 74/86 kB
  954. Progress (2): 96/152 kB | 77/86 kB
  955. Progress (2): 99/152 kB | 77/86 kB
  956. Progress (2): 99/152 kB | 80/86 kB
  957. Progress (2): 99/152 kB | 82/86 kB
  958. Progress (2): 99/152 kB | 85/86 kB
  959. Progress (2): 99/152 kB | 86 kB
  960. Progress (3): 99/152 kB | 86 kB | 2.7/10 kB
  961. Progress (3): 99/152 kB | 86 kB | 5.5/10 kB
  962. Progress (3): 99/152 kB | 86 kB | 8.2/10 kB
  963. Progress (3): 99/152 kB | 86 kB | 10 kB
  964. Progress (4): 99/152 kB | 86 kB | 10 kB | 4.1/121 kB
  965. Progress (4): 99/152 kB | 86 kB | 10 kB | 8.2/121 kB
  966. Progress (4): 99/152 kB | 86 kB | 10 kB | 12/121 kB
  967. Progress (4): 99/152 kB | 86 kB | 10 kB | 16/121 kB
  968. Progress (5): 99/152 kB | 86 kB | 10 kB | 16/121 kB | 4.1/194 kB
  969. Progress (5): 99/152 kB | 86 kB | 10 kB | 16/121 kB | 8.2/194 kB
  970. Progress (5): 99/152 kB | 86 kB | 10 kB | 16/121 kB | 12/194 kB
  971. Progress (5): 99/152 kB | 86 kB | 10 kB | 16/121 kB | 16/194 kB
  972. Progress (5): 101/152 kB | 86 kB | 10 kB | 16/121 kB | 16/194 kB
  973. Progress (5): 104/152 kB | 86 kB | 10 kB | 16/121 kB | 16/194 kB
  974. Progress (5): 104/152 kB | 86 kB | 10 kB | 20/121 kB | 16/194 kB
  975. Progress (5): 107/152 kB | 86 kB | 10 kB | 20/121 kB | 16/194 kB
  976. Progress (5): 107/152 kB | 86 kB | 10 kB | 25/121 kB | 16/194 kB
  977. Progress (5): 107/152 kB | 86 kB | 10 kB | 29/121 kB | 16/194 kB
  978. Progress (5): 107/152 kB | 86 kB | 10 kB | 33/121 kB | 16/194 kB
  979. Progress (5): 107/152 kB | 86 kB | 10 kB | 37/121 kB | 16/194 kB
  980. Progress (5): 107/152 kB | 86 kB | 10 kB | 41/121 kB | 16/194 kB
  981. Progress (5): 107/152 kB | 86 kB | 10 kB | 45/121 kB | 16/194 kB
  982. Progress (5): 107/152 kB | 86 kB | 10 kB | 49/121 kB | 16/194 kB
  983. Progress (5): 107/152 kB | 86 kB | 10 kB | 49/121 kB | 20/194 kB
  984. Progress (5): 107/152 kB | 86 kB | 10 kB | 49/121 kB | 25/194 kB
  985. Progress (5): 107/152 kB | 86 kB | 10 kB | 49/121 kB | 29/194 kB
  986. Progress (5): 107/152 kB | 86 kB | 10 kB | 49/121 kB | 33/194 kB
  987. Progress (5): 107/152 kB | 86 kB | 10 kB | 49/121 kB | 37/194 kB
  988. Progress (5): 107/152 kB | 86 kB | 10 kB | 49/121 kB | 41/194 kB
  989. Progress (5): 107/152 kB | 86 kB | 10 kB | 49/121 kB | 45/194 kB
  990. Progress (5): 107/152 kB | 86 kB | 10 kB | 49/121 kB | 49/194 kB
  991.  
  992. Downloaded from central: https://repo.maven.apache.org/maven2/org/apache/maven/maven-model/2.0.6/maven-model-2.0.6.jar (86 kB at 16 kB/s)
  993. Downloading from central: https://repo.maven.apache.org/maven2/org/codehaus/plexus/plexus-utils/2.0.5/plexus-utils-2.0.5.jar
  994. Downloaded from central: https://repo.maven.apache.org/maven2/org/apache/maven/maven-monitor/2.0.6/maven-monitor-2.0.6.jar (10 kB at 1.9 kB/s)
  995. Downloading from central: https://repo.maven.apache.org/maven2/org/apache/maven/shared/maven-filtering/1.1/maven-filtering-1.1.jar
  996. Progress (3): 110/152 kB | 49/121 kB | 49/194 kB
  997. Progress (3): 112/152 kB | 49/121 kB | 49/194 kB
  998. Progress (3): 115/152 kB | 49/121 kB | 49/194 kB
  999. Progress (3): 115/152 kB | 53/121 kB | 49/194 kB
  1000. Progress (3): 118/152 kB | 53/121 kB | 49/194 kB
  1001. Progress (3): 118/152 kB | 57/121 kB | 49/194 kB
  1002. Progress (3): 118/152 kB | 61/121 kB | 49/194 kB
  1003. Progress (3): 118/152 kB | 66/121 kB | 49/194 kB
  1004. Progress (3): 118/152 kB | 70/121 kB | 49/194 kB
  1005. Progress (3): 118/152 kB | 70/121 kB | 53/194 kB
  1006. Progress (3): 118/152 kB | 74/121 kB | 53/194 kB
  1007. Progress (3): 118/152 kB | 74/121 kB | 57/194 kB
  1008. Progress (3): 118/152 kB | 78/121 kB | 57/194 kB
  1009. Progress (3): 118/152 kB | 82/121 kB | 57/194 kB
  1010. Progress (3): 118/152 kB | 82/121 kB | 61/194 kB
  1011. Progress (4): 118/152 kB | 82/121 kB | 61/194 kB | 2.7/223 kB
  1012. Progress (4): 118/152 kB | 86/121 kB | 61/194 kB | 2.7/223 kB
  1013. Progress (4): 118/152 kB | 86/121 kB | 66/194 kB | 2.7/223 kB
  1014. Progress (4): 118/152 kB | 90/121 kB | 66/194 kB | 2.7/223 kB
  1015. Progress (4): 118/152 kB | 94/121 kB | 66/194 kB | 2.7/223 kB
  1016. Progress (4): 118/152 kB | 94/121 kB | 70/194 kB | 2.7/223 kB
  1017. Progress (4): 118/152 kB | 94/121 kB | 70/194 kB | 5.5/223 kB
  1018. Progress (4): 118/152 kB | 94/121 kB | 74/194 kB | 5.5/223 kB
  1019. Progress (4): 118/152 kB | 94/121 kB | 78/194 kB | 5.5/223 kB
  1020. Progress (4): 118/152 kB | 98/121 kB | 78/194 kB | 5.5/223 kB
  1021. Progress (4): 118/152 kB | 98/121 kB | 82/194 kB | 5.5/223 kB
  1022. Progress (5): 118/152 kB | 98/121 kB | 82/194 kB | 5.5/223 kB | 2.7/43 kB
  1023. Progress (5): 118/152 kB | 98/121 kB | 82/194 kB | 8.2/223 kB | 2.7/43 kB
  1024. Progress (5): 118/152 kB | 98/121 kB | 82/194 kB | 8.2/223 kB | 5.5/43 kB
  1025. Progress (5): 118/152 kB | 98/121 kB | 82/194 kB | 11/223 kB | 5.5/43 kB
  1026. Progress (5): 118/152 kB | 98/121 kB | 82/194 kB | 11/223 kB | 8.2/43 kB
  1027. Progress (5): 118/152 kB | 98/121 kB | 82/194 kB | 14/223 kB | 8.2/43 kB
  1028. Progress (5): 118/152 kB | 98/121 kB | 82/194 kB | 14/223 kB | 11/43 kB
  1029. Progress (5): 118/152 kB | 98/121 kB | 82/194 kB | 16/223 kB | 11/43 kB
  1030. Progress (5): 118/152 kB | 98/121 kB | 82/194 kB | 16/223 kB | 14/43 kB
  1031. Progress (5): 118/152 kB | 98/121 kB | 82/194 kB | 19/223 kB | 14/43 kB
  1032. Progress (5): 118/152 kB | 98/121 kB | 82/194 kB | 19/223 kB | 16/43 kB
  1033. Progress (5): 118/152 kB | 98/121 kB | 82/194 kB | 22/223 kB | 16/43 kB
  1034. Progress (5): 118/152 kB | 98/121 kB | 82/194 kB | 22/223 kB | 19/43 kB
  1035. Progress (5): 118/152 kB | 98/121 kB | 82/194 kB | 25/223 kB | 19/43 kB
  1036. Progress (5): 118/152 kB | 98/121 kB | 82/194 kB | 25/223 kB | 22/43 kB
  1037. Progress (5): 118/152 kB | 98/121 kB | 82/194 kB | 27/223 kB | 22/43 kB
  1038. Progress (5): 118/152 kB | 98/121 kB | 82/194 kB | 27/223 kB | 25/43 kB
  1039. Progress (5): 118/152 kB | 98/121 kB | 82/194 kB | 30/223 kB | 25/43 kB
  1040. Progress (5): 118/152 kB | 98/121 kB | 82/194 kB | 30/223 kB | 27/43 kB
  1041. Progress (5): 118/152 kB | 98/121 kB | 82/194 kB | 33/223 kB | 27/43 kB
  1042. Progress (5): 118/152 kB | 98/121 kB | 82/194 kB | 33/223 kB | 30/43 kB
  1043. Progress (5): 118/152 kB | 98/121 kB | 82/194 kB | 36/223 kB | 30/43 kB
  1044. Progress (5): 118/152 kB | 98/121 kB | 82/194 kB | 36/223 kB | 33/43 kB
  1045. Progress (5): 118/152 kB | 98/121 kB | 82/194 kB | 38/223 kB | 33/43 kB
  1046. Progress (5): 118/152 kB | 98/121 kB | 82/194 kB | 38/223 kB | 36/43 kB
  1047. Progress (5): 118/152 kB | 98/121 kB | 82/194 kB | 41/223 kB | 36/43 kB
  1048. Progress (5): 118/152 kB | 98/121 kB | 82/194 kB | 41/223 kB | 38/43 kB
  1049. Progress (5): 118/152 kB | 98/121 kB | 82/194 kB | 44/223 kB | 38/43 kB
  1050. Progress (5): 118/152 kB | 98/121 kB | 82/194 kB | 44/223 kB | 41/43 kB
  1051. Progress (5): 118/152 kB | 98/121 kB | 82/194 kB | 47/223 kB | 41/43 kB
  1052. Progress (5): 118/152 kB | 98/121 kB | 82/194 kB | 47/223 kB | 43 kB
  1053. Progress (5): 118/152 kB | 98/121 kB | 82/194 kB | 49/223 kB | 43 kB
  1054. Progress (5): 118/152 kB | 98/121 kB | 82/194 kB | 52/223 kB | 43 kB
  1055. Progress (5): 118/152 kB | 98/121 kB | 82/194 kB | 55/223 kB | 43 kB
  1056. Progress (5): 118/152 kB | 98/121 kB | 82/194 kB | 58/223 kB | 43 kB
  1057. Progress (5): 118/152 kB | 98/121 kB | 82/194 kB | 60/223 kB | 43 kB
  1058. Progress (5): 118/152 kB | 98/121 kB | 82/194 kB | 63/223 kB | 43 kB
  1059. Progress (5): 118/152 kB | 98/121 kB | 82/194 kB | 66/223 kB | 43 kB
  1060. Progress (5): 118/152 kB | 98/121 kB | 82/194 kB | 69/223 kB | 43 kB
  1061. Progress (5): 118/152 kB | 98/121 kB | 82/194 kB | 71/223 kB | 43 kB
  1062. Progress (5): 121/152 kB | 98/121 kB | 82/194 kB | 71/223 kB | 43 kB
  1063. Progress (5): 123/152 kB | 98/121 kB | 82/194 kB | 71/223 kB | 43 kB
  1064. Progress (5): 126/152 kB | 98/121 kB | 82/194 kB | 71/223 kB | 43 kB
  1065. Progress (5): 129/152 kB | 98/121 kB | 82/194 kB | 71/223 kB | 43 kB
  1066. Progress (5): 129/152 kB | 98/121 kB | 86/194 kB | 71/223 kB | 43 kB
  1067. Progress (5): 129/152 kB | 98/121 kB | 90/194 kB | 71/223 kB | 43 kB
  1068. Progress (5): 129/152 kB | 102/121 kB | 90/194 kB | 71/223 kB | 43 kB
  1069. Progress (5): 129/152 kB | 102/121 kB | 94/194 kB | 71/223 kB | 43 kB
  1070. Progress (5): 129/152 kB | 102/121 kB | 94/194 kB | 74/223 kB | 43 kB
  1071. Progress (5): 129/152 kB | 102/121 kB | 98/194 kB | 74/223 kB | 43 kB
  1072. Progress (5): 129/152 kB | 106/121 kB | 98/194 kB | 74/223 kB | 43 kB
  1073. Progress (5): 129/152 kB | 106/121 kB | 98/194 kB | 77/223 kB | 43 kB
  1074. Progress (5): 129/152 kB | 106/121 kB | 102/194 kB | 77/223 kB | 43 kB
  1075. Progress (5): 129/152 kB | 111/121 kB | 102/194 kB | 77/223 kB | 43 kB
  1076. Progress (5): 129/152 kB | 111/121 kB | 106/194 kB | 77/223 kB | 43 kB
  1077. Progress (5): 129/152 kB | 111/121 kB | 106/194 kB | 80/223 kB | 43 kB
  1078. Progress (5): 129/152 kB | 111/121 kB | 111/194 kB | 80/223 kB | 43 kB
  1079. Progress (5): 129/152 kB | 115/121 kB | 111/194 kB | 80/223 kB | 43 kB
  1080. Progress (5): 129/152 kB | 115/121 kB | 115/194 kB | 80/223 kB | 43 kB
  1081. Progress (5): 129/152 kB | 115/121 kB | 115/194 kB | 82/223 kB | 43 kB
  1082. Progress (5): 129/152 kB | 119/121 kB | 115/194 kB | 82/223 kB | 43 kB
  1083. Progress (5): 129/152 kB | 119/121 kB | 115/194 kB | 85/223 kB | 43 kB
  1084. Progress (5): 129/152 kB | 119/121 kB | 115/194 kB | 88/223 kB | 43 kB
  1085. Progress (5): 129/152 kB | 121 kB | 115/194 kB | 88/223 kB | 43 kB
  1086. Progress (5): 129/152 kB | 121 kB | 115/194 kB | 90/223 kB | 43 kB
  1087.  
  1088. Downloaded from central: https://repo.maven.apache.org/maven2/org/apache/maven/shared/maven-filtering/1.1/maven-filtering-1.1.jar (43 kB at 6.9 kB/s)
  1089. Progress (4): 129/152 kB | 121 kB | 115/194 kB | 93/223 kB
  1090.  
  1091. Downloading from central: https://repo.maven.apache.org/maven2/org/sonatype/plexus/plexus-build-api/0.0.4/plexus-build-api-0.0.4.jar
  1092. Progress (4): 129/152 kB | 121 kB | 115/194 kB | 96/223 kB
  1093. Progress (4): 129/152 kB | 121 kB | 115/194 kB | 99/223 kB
  1094. Progress (4): 129/152 kB | 121 kB | 115/194 kB | 101/223 kB
  1095. Progress (4): 129/152 kB | 121 kB | 115/194 kB | 104/223 kB
  1096. Progress (4): 129/152 kB | 121 kB | 115/194 kB | 107/223 kB
  1097. Progress (4): 129/152 kB | 121 kB | 115/194 kB | 110/223 kB
  1098. Progress (4): 129/152 kB | 121 kB | 115/194 kB | 112/223 kB
  1099. Progress (4): 129/152 kB | 121 kB | 115/194 kB | 115/223 kB
  1100. Progress (4): 129/152 kB | 121 kB | 115/194 kB | 118/223 kB
  1101. Progress (4): 129/152 kB | 121 kB | 115/194 kB | 121/223 kB
  1102. Progress (4): 129/152 kB | 121 kB | 115/194 kB | 123/223 kB
  1103. Progress (4): 129/152 kB | 121 kB | 115/194 kB | 126/223 kB
  1104. Progress (4): 129/152 kB | 121 kB | 115/194 kB | 129/223 kB
  1105. Progress (4): 129/152 kB | 121 kB | 115/194 kB | 132/223 kB
  1106. Progress (4): 129/152 kB | 121 kB | 115/194 kB | 134/223 kB
  1107. Progress (4): 129/152 kB | 121 kB | 115/194 kB | 137/223 kB
  1108. Progress (4): 129/152 kB | 121 kB | 115/194 kB | 140/223 kB
  1109. Progress (4): 129/152 kB | 121 kB | 115/194 kB | 143/223 kB
  1110. Progress (4): 132/152 kB | 121 kB | 115/194 kB | 143/223 kB
  1111. Progress (4): 134/152 kB | 121 kB | 115/194 kB | 143/223 kB
  1112. Progress (4): 137/152 kB | 121 kB | 115/194 kB | 143/223 kB
  1113. Progress (4): 140/152 kB | 121 kB | 115/194 kB | 143/223 kB
  1114. Progress (4): 140/152 kB | 121 kB | 119/194 kB | 143/223 kB
  1115. Progress (4): 140/152 kB | 121 kB | 123/194 kB | 143/223 kB
  1116. Progress (4): 140/152 kB | 121 kB | 127/194 kB | 143/223 kB
  1117. Progress (4): 140/152 kB | 121 kB | 127/194 kB | 145/223 kB
  1118. Progress (4): 140/152 kB | 121 kB | 131/194 kB | 145/223 kB
  1119. Progress (4): 140/152 kB | 121 kB | 131/194 kB | 148/223 kB
  1120. Progress (4): 140/152 kB | 121 kB | 135/194 kB | 148/223 kB
  1121. Progress (4): 140/152 kB | 121 kB | 135/194 kB | 151/223 kB
  1122. Progress (4): 140/152 kB | 121 kB | 139/194 kB | 151/223 kB
  1123. Progress (4): 140/152 kB | 121 kB | 139/194 kB | 154/223 kB
  1124. Progress (4): 140/152 kB | 121 kB | 143/194 kB | 154/223 kB
  1125. Progress (4): 140/152 kB | 121 kB | 143/194 kB | 156/223 kB
  1126. Progress (4): 140/152 kB | 121 kB | 147/194 kB | 156/223 kB
  1127. Progress (4): 143/152 kB | 121 kB | 147/194 kB | 156/223 kB
  1128. Progress (4): 143/152 kB | 121 kB | 147/194 kB | 159/223 kB
  1129. Progress (4): 143/152 kB | 121 kB | 147/194 kB | 162/223 kB
  1130. Progress (5): 143/152 kB | 121 kB | 147/194 kB | 162/223 kB | 2.7/6.8 kB
  1131. Progress (5): 143/152 kB | 121 kB | 147/194 kB | 165/223 kB | 2.7/6.8 kB
  1132. Progress (5): 143/152 kB | 121 kB | 147/194 kB | 165/223 kB | 5.5/6.8 kB
  1133.  
  1134. Downloaded from central: https://repo.maven.apache.org/maven2/junit/junit/3.8.1/junit-3.8.1.jar (121 kB at 18 kB/s)
  1135. Progress (4): 143/152 kB | 147/194 kB | 165/223 kB | 6.8 kB
  1136. Progress (4): 143/152 kB | 147/194 kB | 167/223 kB | 6.8 kB
  1137.  
  1138. Downloading from central: https://repo.maven.apache.org/maven2/org/codehaus/plexus/plexus-interpolation/1.13/plexus-interpolation-1.13.jar
  1139. Progress (4): 143/152 kB | 147/194 kB | 170/223 kB | 6.8 kB
  1140. Progress (4): 143/152 kB | 147/194 kB | 173/223 kB | 6.8 kB
  1141. Progress (4): 143/152 kB | 147/194 kB | 175/223 kB | 6.8 kB
  1142. Progress (4): 143/152 kB | 147/194 kB | 178/223 kB | 6.8 kB
  1143. Progress (4): 143/152 kB | 147/194 kB | 181/223 kB | 6.8 kB
  1144. Progress (4): 143/152 kB | 147/194 kB | 184/223 kB | 6.8 kB
  1145. Progress (4): 143/152 kB | 147/194 kB | 186/223 kB | 6.8 kB
  1146. Progress (4): 143/152 kB | 147/194 kB | 189/223 kB | 6.8 kB
  1147. Progress (4): 143/152 kB | 147/194 kB | 192/223 kB | 6.8 kB
  1148. Progress (4): 143/152 kB | 147/194 kB | 195/223 kB | 6.8 kB
  1149. Progress (4): 143/152 kB | 147/194 kB | 197/223 kB | 6.8 kB
  1150. Progress (4): 143/152 kB | 147/194 kB | 200/223 kB | 6.8 kB
  1151. Progress (4): 143/152 kB | 147/194 kB | 203/223 kB | 6.8 kB
  1152. Progress (4): 143/152 kB | 147/194 kB | 206/223 kB | 6.8 kB
  1153. Progress (4): 143/152 kB | 147/194 kB | 208/223 kB | 6.8 kB
  1154. Progress (4): 143/152 kB | 147/194 kB | 211/223 kB | 6.8 kB
  1155. Progress (4): 143/152 kB | 147/194 kB | 214/223 kB | 6.8 kB
  1156. Progress (4): 143/152 kB | 152/194 kB | 214/223 kB | 6.8 kB
  1157. Progress (4): 143/152 kB | 156/194 kB | 214/223 kB | 6.8 kB
  1158. Progress (4): 143/152 kB | 160/194 kB | 214/223 kB | 6.8 kB
  1159. Progress (4): 143/152 kB | 164/194 kB | 214/223 kB | 6.8 kB
  1160. Progress (4): 143/152 kB | 168/194 kB | 214/223 kB | 6.8 kB
  1161. Progress (4): 143/152 kB | 172/194 kB | 214/223 kB | 6.8 kB
  1162. Progress (4): 143/152 kB | 176/194 kB | 214/223 kB | 6.8 kB
  1163. Progress (4): 143/152 kB | 180/194 kB | 214/223 kB | 6.8 kB
  1164. Progress (4): 145/152 kB | 180/194 kB | 214/223 kB | 6.8 kB
  1165. Progress (4): 148/152 kB | 180/194 kB | 214/223 kB | 6.8 kB
  1166. Progress (4): 148/152 kB | 180/194 kB | 217/223 kB | 6.8 kB
  1167. Progress (4): 148/152 kB | 180/194 kB | 219/223 kB | 6.8 kB
  1168. Progress (4): 148/152 kB | 180/194 kB | 222/223 kB | 6.8 kB
  1169. Progress (4): 148/152 kB | 180/194 kB | 223 kB | 6.8 kB
  1170.  
  1171. Downloaded from central: https://repo.maven.apache.org/maven2/org/sonatype/plexus/plexus-build-api/0.0.4/plexus-build-api-0.0.4.jar (6.8 kB at 995 B/s)
  1172. Progress (4): 148/152 kB | 180/194 kB | 223 kB | 4.1/61 kB
  1173. Progress (4): 148/152 kB | 180/194 kB | 223 kB | 8.2/61 kB
  1174. Progress (4): 148/152 kB | 180/194 kB | 223 kB | 12/61 kB
  1175. Progress (4): 148/152 kB | 180/194 kB | 223 kB | 16/61 kB
  1176. Progress (4): 148/152 kB | 180/194 kB | 223 kB | 20/61 kB
  1177. Progress (4): 148/152 kB | 180/194 kB | 223 kB | 25/61 kB
  1178. Progress (4): 148/152 kB | 180/194 kB | 223 kB | 29/61 kB
  1179. Progress (4): 148/152 kB | 180/194 kB | 223 kB | 33/61 kB
  1180. Progress (4): 151/152 kB | 180/194 kB | 223 kB | 33/61 kB
  1181. Progress (4): 151/152 kB | 184/194 kB | 223 kB | 33/61 kB
  1182. Progress (4): 151/152 kB | 188/194 kB | 223 kB | 33/61 kB
  1183. Progress (4): 151/152 kB | 193/194 kB | 223 kB | 33/61 kB
  1184. Progress (4): 151/152 kB | 193/194 kB | 223 kB | 37/61 kB
  1185. Progress (4): 151/152 kB | 194 kB | 223 kB | 37/61 kB
  1186. Progress (4): 152 kB | 194 kB | 223 kB | 37/61 kB
  1187.  
  1188. Downloaded from central: https://repo.maven.apache.org/maven2/org/codehaus/plexus/plexus-utils/2.0.5/plexus-utils-2.0.5.jar (223 kB at 31 kB/s)
  1189. Progress (3): 152 kB | 194 kB | 41/61 kB
  1190. Progress (3): 152 kB | 194 kB | 45/61 kB
  1191. Progress (3): 152 kB | 194 kB | 49/61 kB
  1192. Progress (3): 152 kB | 194 kB | 53/61 kB
  1193. Progress (3): 152 kB | 194 kB | 57/61 kB
  1194. Progress (3): 152 kB | 194 kB | 61 kB
  1195.  
  1196. Downloaded from central: https://repo.maven.apache.org/maven2/org/codehaus/plexus/plexus-interpolation/1.13/plexus-interpolation-1.13.jar (61 kB at 8.2 kB/s)
  1197. Downloaded from central: https://repo.maven.apache.org/maven2/org/codehaus/plexus/plexus-container-default/1.0-alpha-9-stable-1/plexus-container-default-1.0-alpha-9-stable-1.jar (194 kB at 26 kB/s)
  1198. Downloaded from central: https://repo.maven.apache.org/maven2/org/apache/maven/maven-core/2.0.6/maven-core-2.0.6.jar (152 kB at 20 kB/s)
  1199. [INFO] Using 'UTF-8' encoding to copy filtered resources.
  1200. [INFO] skip non existing resourceDirectory /root/.jenkins/workspace/jenkins_pipeline_demo/src/main/resources
  1201. [INFO]
  1202. [INFO] --- maven-compiler-plugin:3.1:compile (default-compile) @ simple-maven-project-with-tests ---
  1203. Downloading from central: https://repo.maven.apache.org/maven2/org/apache/maven/maven-plugin-api/2.0.9/maven-plugin-api-2.0.9.pom
  1204. Progress (1): 1.5 kB
  1205.  
  1206. Downloaded from central: https://repo.maven.apache.org/maven2/org/apache/maven/maven-plugin-api/2.0.9/maven-plugin-api-2.0.9.pom (1.5 kB at 2.1 kB/s)
  1207. Downloading from central: https://repo.maven.apache.org/maven2/org/apache/maven/maven/2.0.9/maven-2.0.9.pom
  1208. Progress (1): 4.1/19 kB
  1209. Progress (1): 8.2/19 kB
  1210. Progress (1): 12/19 kB
  1211. Progress (1): 16/19 kB
  1212. Progress (1): 19 kB
  1213.  
  1214. Downloaded from central: https://repo.maven.apache.org/maven2/org/apache/maven/maven/2.0.9/maven-2.0.9.pom (19 kB at 22 kB/s)
  1215. Downloading from central: https://repo.maven.apache.org/maven2/org/apache/maven/maven-parent/8/maven-parent-8.pom
  1216. Progress (1): 4.1/24 kB
  1217. Progress (1): 8.2/24 kB
  1218. Progress (1): 12/24 kB
  1219. Progress (1): 16/24 kB
  1220. Progress (1): 20/24 kB
  1221. Progress (1): 24 kB
  1222.  
  1223. Downloaded from central: https://repo.maven.apache.org/maven2/org/apache/maven/maven-parent/8/maven-parent-8.pom (24 kB at 37 kB/s)
  1224. Downloading from central: https://repo.maven.apache.org/maven2/org/apache/apache/4/apache-4.pom
  1225. Progress (1): 4.1/4.5 kB
  1226. Progress (1): 4.5 kB
  1227.  
  1228. Downloaded from central: https://repo.maven.apache.org/maven2/org/apache/apache/4/apache-4.pom (4.5 kB at 4.9 kB/s)
  1229. Downloading from central: https://repo.maven.apache.org/maven2/org/apache/maven/maven-artifact/2.0.9/maven-artifact-2.0.9.pom
  1230. Progress (1): 1.6 kB
  1231.  
  1232. Downloaded from central: https://repo.maven.apache.org/maven2/org/apache/maven/maven-artifact/2.0.9/maven-artifact-2.0.9.pom (1.6 kB at 1.3 kB/s)
  1233. Downloading from central: https://repo.maven.apache.org/maven2/org/codehaus/plexus/plexus-utils/1.5.1/plexus-utils-1.5.1.pom
  1234. Progress (1): 2.3 kB
  1235.  
  1236. Downloaded from central: https://repo.maven.apache.org/maven2/org/codehaus/plexus/plexus-utils/1.5.1/plexus-utils-1.5.1.pom (2.3 kB at 3.8 kB/s)
  1237. Downloading from central: https://repo.maven.apache.org/maven2/org/apache/maven/maven-core/2.0.9/maven-core-2.0.9.pom
  1238. Progress (1): 4.1/7.8 kB
  1239. Progress (1): 7.8 kB
  1240.  
  1241. Downloaded from central: https://repo.maven.apache.org/maven2/org/apache/maven/maven-core/2.0.9/maven-core-2.0.9.pom (7.8 kB at 8.6 kB/s)
  1242. Downloading from central: https://repo.maven.apache.org/maven2/org/apache/maven/maven-settings/2.0.9/maven-settings-2.0.9.pom
  1243. Progress (1): 2.1 kB
  1244.  
  1245. Downloaded from central: https://repo.maven.apache.org/maven2/org/apache/maven/maven-settings/2.0.9/maven-settings-2.0.9.pom (2.1 kB at 2.3 kB/s)
  1246. Downloading from central: https://repo.maven.apache.org/maven2/org/apache/maven/maven-model/2.0.9/maven-model-2.0.9.pom
  1247. Progress (1): 3.1 kB
  1248.  
  1249. Downloaded from central: https://repo.maven.apache.org/maven2/org/apache/maven/maven-model/2.0.9/maven-model-2.0.9.pom (3.1 kB at 3.5 kB/s)
  1250. Downloading from central: https://repo.maven.apache.org/maven2/org/apache/maven/maven-plugin-parameter-documenter/2.0.9/maven-plugin-parameter-documenter-2.0.9.pom
  1251. Progress (1): 2.0 kB
  1252.  
  1253. Downloaded from central: https://repo.maven.apache.org/maven2/org/apache/maven/maven-plugin-parameter-documenter/2.0.9/maven-plugin-parameter-documenter-2.0.9.pom (2.0 kB at 3.6 kB/s)
  1254. Downloading from central: https://repo.maven.apache.org/maven2/org/apache/maven/maven-profile/2.0.9/maven-profile-2.0.9.pom
  1255. Progress (1): 2.0 kB
  1256.  
  1257. Downloaded from central: https://repo.maven.apache.org/maven2/org/apache/maven/maven-profile/2.0.9/maven-profile-2.0.9.pom (2.0 kB at 2.1 kB/s)
  1258. Downloading from central: https://repo.maven.apache.org/maven2/org/apache/maven/maven-repository-metadata/2.0.9/maven-repository-metadata-2.0.9.pom
  1259. Progress (1): 1.9 kB
  1260.  
  1261. Downloaded from central: https://repo.maven.apache.org/maven2/org/apache/maven/maven-repository-metadata/2.0.9/maven-repository-metadata-2.0.9.pom (1.9 kB at 1.6 kB/s)
  1262. Downloading from central: https://repo.maven.apache.org/maven2/org/apache/maven/maven-error-diagnostics/2.0.9/maven-error-diagnostics-2.0.9.pom
  1263. Progress (1): 1.7 kB
  1264.  
  1265. Downloaded from central: https://repo.maven.apache.org/maven2/org/apache/maven/maven-error-diagnostics/2.0.9/maven-error-diagnostics-2.0.9.pom (1.7 kB at 2.0 kB/s)
  1266. Downloading from central: https://repo.maven.apache.org/maven2/org/apache/maven/maven-project/2.0.9/maven-project-2.0.9.pom
  1267. Progress (1): 2.7 kB
  1268.  
  1269. Downloaded from central: https://repo.maven.apache.org/maven2/org/apache/maven/maven-project/2.0.9/maven-project-2.0.9.pom (2.7 kB at 4.3 kB/s)
  1270. Downloading from central: https://repo.maven.apache.org/maven2/org/apache/maven/maven-artifact-manager/2.0.9/maven-artifact-manager-2.0.9.pom
  1271. Progress (1): 2.7 kB
  1272.  
  1273. Downloaded from central: https://repo.maven.apache.org/maven2/org/apache/maven/maven-artifact-manager/2.0.9/maven-artifact-manager-2.0.9.pom (2.7 kB at 4.5 kB/s)
  1274. Downloading from central: https://repo.maven.apache.org/maven2/org/apache/maven/maven-plugin-registry/2.0.9/maven-plugin-registry-2.0.9.pom
  1275. Progress (1): 2.0 kB
  1276.  
  1277. Downloaded from central: https://repo.maven.apache.org/maven2/org/apache/maven/maven-plugin-registry/2.0.9/maven-plugin-registry-2.0.9.pom (2.0 kB at 2.2 kB/s)
  1278. Downloading from central: https://repo.maven.apache.org/maven2/org/apache/maven/maven-plugin-descriptor/2.0.9/maven-plugin-descriptor-2.0.9.pom
  1279. Progress (1): 2.1 kB
  1280.  
  1281. Downloaded from central: https://repo.maven.apache.org/maven2/org/apache/maven/maven-plugin-descriptor/2.0.9/maven-plugin-descriptor-2.0.9.pom (2.1 kB at 3.5 kB/s)
  1282. Downloading from central: https://repo.maven.apache.org/maven2/org/apache/maven/maven-monitor/2.0.9/maven-monitor-2.0.9.pom
  1283. Progress (1): 1.3 kB
  1284.  
  1285. Downloaded from central: https://repo.maven.apache.org/maven2/org/apache/maven/maven-monitor/2.0.9/maven-monitor-2.0.9.pom (1.3 kB at 1.4 kB/s)
  1286. Downloading from central: https://repo.maven.apache.org/maven2/org/apache/maven/maven-toolchain/1.0/maven-toolchain-1.0.pom
  1287. Progress (1): 3.4 kB
  1288.  
  1289. Downloaded from central: https://repo.maven.apache.org/maven2/org/apache/maven/maven-toolchain/1.0/maven-toolchain-1.0.pom (3.4 kB at 5.7 kB/s)
  1290. Downloading from central: https://repo.maven.apache.org/maven2/org/apache/maven/shared/maven-shared-utils/0.1/maven-shared-utils-0.1.pom
  1291. Progress (1): 4.0 kB
  1292.  
  1293. Downloaded from central: https://repo.maven.apache.org/maven2/org/apache/maven/shared/maven-shared-utils/0.1/maven-shared-utils-0.1.pom (4.0 kB at 3.4 kB/s)
  1294. Downloading from central: https://repo.maven.apache.org/maven2/org/apache/maven/shared/maven-shared-components/18/maven-shared-components-18.pom
  1295. Progress (1): 4.1/4.9 kB
  1296. Progress (1): 4.9 kB
  1297.  
  1298. Downloaded from central: https://repo.maven.apache.org/maven2/org/apache/maven/shared/maven-shared-components/18/maven-shared-components-18.pom (4.9 kB at 4.0 kB/s)
  1299. Downloading from central: https://repo.maven.apache.org/maven2/com/google/code/findbugs/jsr305/2.0.1/jsr305-2.0.1.pom
  1300. Progress (1): 965 B
  1301.  
  1302. Downloaded from central: https://repo.maven.apache.org/maven2/com/google/code/findbugs/jsr305/2.0.1/jsr305-2.0.1.pom (965 B at 794 B/s)
  1303. Downloading from central: https://repo.maven.apache.org/maven2/org/apache/maven/shared/maven-shared-incremental/1.1/maven-shared-incremental-1.1.pom
  1304. Progress (1): 4.1/4.7 kB
  1305. Progress (1): 4.7 kB
  1306.  
  1307. Downloaded from central: https://repo.maven.apache.org/maven2/org/apache/maven/shared/maven-shared-incremental/1.1/maven-shared-incremental-1.1.pom (4.7 kB at 5.2 kB/s)
  1308. Downloading from central: https://repo.maven.apache.org/maven2/org/apache/maven/shared/maven-shared-components/19/maven-shared-components-19.pom
  1309. Progress (1): 4.1/6.4 kB
  1310. Progress (1): 6.4 kB
  1311.  
  1312. Downloaded from central: https://repo.maven.apache.org/maven2/org/apache/maven/shared/maven-shared-components/19/maven-shared-components-19.pom (6.4 kB at 7.0 kB/s)
  1313. Downloading from central: https://repo.maven.apache.org/maven2/org/apache/maven/maven-plugin-api/2.2.1/maven-plugin-api-2.2.1.pom
  1314. Progress (1): 1.5 kB
  1315.  
  1316. Downloaded from central: https://repo.maven.apache.org/maven2/org/apache/maven/maven-plugin-api/2.2.1/maven-plugin-api-2.2.1.pom (1.5 kB at 1.7 kB/s)
  1317. Downloading from central: https://repo.maven.apache.org/maven2/org/apache/maven/maven/2.2.1/maven-2.2.1.pom
  1318. Progress (1): 4.1/22 kB
  1319. Progress (1): 8.2/22 kB
  1320. Progress (1): 12/22 kB
  1321. Progress (1): 16/22 kB
  1322. Progress (1): 20/22 kB
  1323. Progress (1): 22 kB
  1324.  
  1325. Downloaded from central: https://repo.maven.apache.org/maven2/org/apache/maven/maven/2.2.1/maven-2.2.1.pom (22 kB at 35 kB/s)
  1326. Downloading from central: https://repo.maven.apache.org/maven2/org/apache/maven/maven-parent/11/maven-parent-11.pom
  1327. Progress (1): 4.1/32 kB
  1328. Progress (1): 8.2/32 kB
  1329. Progress (1): 12/32 kB
  1330. Progress (1): 16/32 kB
  1331. Progress (1): 20/32 kB
  1332. Progress (1): 25/32 kB
  1333. Progress (1): 29/32 kB
  1334. Progress (1): 32 kB
  1335.  
  1336. Downloaded from central: https://repo.maven.apache.org/maven2/org/apache/maven/maven-parent/11/maven-parent-11.pom (32 kB at 36 kB/s)
  1337. Downloading from central: https://repo.maven.apache.org/maven2/org/apache/apache/5/apache-5.pom
  1338. Progress (1): 4.1/4.1 kB
  1339. Progress (1): 4.1 kB
  1340.  
  1341. Downloaded from central: https://repo.maven.apache.org/maven2/org/apache/apache/5/apache-5.pom (4.1 kB at 4.8 kB/s)
  1342. Downloading from central: https://repo.maven.apache.org/maven2/org/apache/maven/maven-core/2.2.1/maven-core-2.2.1.pom
  1343. Progress (1): 4.1/12 kB
  1344. Progress (1): 8.2/12 kB
  1345. Progress (1): 12 kB
  1346.  
  1347. Downloaded from central: https://repo.maven.apache.org/maven2/org/apache/maven/maven-core/2.2.1/maven-core-2.2.1.pom (12 kB at 18 kB/s)
  1348. Downloading from central: https://repo.maven.apache.org/maven2/org/apache/maven/maven-settings/2.2.1/maven-settings-2.2.1.pom
  1349. Progress (1): 2.2 kB
  1350.  
  1351. Downloaded from central: https://repo.maven.apache.org/maven2/org/apache/maven/maven-settings/2.2.1/maven-settings-2.2.1.pom (2.2 kB at 3.6 kB/s)
  1352. Downloading from central: https://repo.maven.apache.org/maven2/org/apache/maven/maven-model/2.2.1/maven-model-2.2.1.pom
  1353. Progress (1): 3.2 kB
  1354.  
  1355. Downloaded from central: https://repo.maven.apache.org/maven2/org/apache/maven/maven-model/2.2.1/maven-model-2.2.1.pom (3.2 kB at 3.6 kB/s)
  1356. Downloading from central: https://repo.maven.apache.org/maven2/org/codehaus/plexus/plexus-interpolation/1.11/plexus-interpolation-1.11.pom
  1357. Progress (1): 889 B
  1358.  
  1359. Downloaded from central: https://repo.maven.apache.org/maven2/org/codehaus/plexus/plexus-interpolation/1.11/plexus-interpolation-1.11.pom (889 B at 982 B/s)
  1360. Downloading from central: https://repo.maven.apache.org/maven2/org/apache/maven/maven-plugin-parameter-documenter/2.2.1/maven-plugin-parameter-documenter-2.2.1.pom
  1361. Progress (1): 2.0 kB
  1362.  
  1363. Downloaded from central: https://repo.maven.apache.org/maven2/org/apache/maven/maven-plugin-parameter-documenter/2.2.1/maven-plugin-parameter-documenter-2.2.1.pom (2.0 kB at 3.2 kB/s)
  1364. Downloading from central: https://repo.maven.apache.org/maven2/org/slf4j/slf4j-jdk14/1.5.6/slf4j-jdk14-1.5.6.pom
  1365. Progress (1): 1.9 kB
  1366.  
  1367. Downloaded from central: https://repo.maven.apache.org/maven2/org/slf4j/slf4j-jdk14/1.5.6/slf4j-jdk14-1.5.6.pom (1.9 kB at 3.1 kB/s)
  1368. Downloading from central: https://repo.maven.apache.org/maven2/org/slf4j/slf4j-parent/1.5.6/slf4j-parent-1.5.6.pom
  1369. Progress (1): 4.1/7.9 kB
  1370. Progress (1): 7.9 kB
  1371.  
  1372. Downloaded from central: https://repo.maven.apache.org/maven2/org/slf4j/slf4j-parent/1.5.6/slf4j-parent-1.5.6.pom (7.9 kB at 14 kB/s)
  1373. Downloading from central: https://repo.maven.apache.org/maven2/org/slf4j/slf4j-api/1.5.6/slf4j-api-1.5.6.pom
  1374. Progress (1): 3.0 kB
  1375.  
  1376. Downloaded from central: https://repo.maven.apache.org/maven2/org/slf4j/slf4j-api/1.5.6/slf4j-api-1.5.6.pom (3.0 kB at 4.9 kB/s)
  1377. Downloading from central: https://repo.maven.apache.org/maven2/org/slf4j/jcl-over-slf4j/1.5.6/jcl-over-slf4j-1.5.6.pom
  1378. Progress (1): 2.2 kB
  1379.  
  1380. Downloaded from central: https://repo.maven.apache.org/maven2/org/slf4j/jcl-over-slf4j/1.5.6/jcl-over-slf4j-1.5.6.pom (2.2 kB at 3.3 kB/s)
  1381. Downloading from central: https://repo.maven.apache.org/maven2/org/apache/maven/maven-profile/2.2.1/maven-profile-2.2.1.pom
  1382. Progress (1): 2.2 kB
  1383.  
  1384. Downloaded from central: https://repo.maven.apache.org/maven2/org/apache/maven/maven-profile/2.2.1/maven-profile-2.2.1.pom (2.2 kB at 2.7 kB/s)
  1385. Downloading from central: https://repo.maven.apache.org/maven2/org/apache/maven/maven-artifact/2.2.1/maven-artifact-2.2.1.pom
  1386. Progress (1): 1.6 kB
  1387.  
  1388. Downloaded from central: https://repo.maven.apache.org/maven2/org/apache/maven/maven-artifact/2.2.1/maven-artifact-2.2.1.pom (1.6 kB at 2.9 kB/s)
  1389. Downloading from central: https://repo.maven.apache.org/maven2/org/apache/maven/maven-repository-metadata/2.2.1/maven-repository-metadata-2.2.1.pom
  1390. Progress (1): 1.9 kB
  1391.  
  1392. Downloaded from central: https://repo.maven.apache.org/maven2/org/apache/maven/maven-repository-metadata/2.2.1/maven-repository-metadata-2.2.1.pom (1.9 kB at 2.4 kB/s)
  1393. Downloading from central: https://repo.maven.apache.org/maven2/org/apache/maven/maven-error-diagnostics/2.2.1/maven-error-diagnostics-2.2.1.pom
  1394. Progress (1): 1.7 kB
  1395.  
  1396. Downloaded from central: https://repo.maven.apache.org/maven2/org/apache/maven/maven-error-diagnostics/2.2.1/maven-error-diagnostics-2.2.1.pom (1.7 kB at 2.9 kB/s)
  1397. Downloading from central: https://repo.maven.apache.org/maven2/org/apache/maven/maven-project/2.2.1/maven-project-2.2.1.pom
  1398. Progress (1): 2.8 kB
  1399.  
  1400. Downloaded from central: https://repo.maven.apache.org/maven2/org/apache/maven/maven-project/2.2.1/maven-project-2.2.1.pom (2.8 kB at 4.7 kB/s)
  1401. Downloading from central: https://repo.maven.apache.org/maven2/org/apache/maven/maven-artifact-manager/2.2.1/maven-artifact-manager-2.2.1.pom
  1402. Progress (1): 3.1 kB
  1403.  
  1404. Downloaded from central: https://repo.maven.apache.org/maven2/org/apache/maven/maven-artifact-manager/2.2.1/maven-artifact-manager-2.2.1.pom (3.1 kB at 5.0 kB/s)
  1405. Downloading from central: https://repo.maven.apache.org/maven2/backport-util-concurrent/backport-util-concurrent/3.1/backport-util-concurrent-3.1.pom
  1406. Progress (1): 880 B
  1407.  
  1408. Downloaded from central: https://repo.maven.apache.org/maven2/backport-util-concurrent/backport-util-concurrent/3.1/backport-util-concurrent-3.1.pom (880 B at 1.5 kB/s)
  1409. Downloading from central: https://repo.maven.apache.org/maven2/org/apache/maven/maven-plugin-registry/2.2.1/maven-plugin-registry-2.2.1.pom
  1410. Progress (1): 1.9 kB
  1411.  
  1412. Downloaded from central: https://repo.maven.apache.org/maven2/org/apache/maven/maven-plugin-registry/2.2.1/maven-plugin-registry-2.2.1.pom (1.9 kB at 3.3 kB/s)
  1413. Downloading from central: https://repo.maven.apache.org/maven2/org/apache/maven/maven-plugin-descriptor/2.2.1/maven-plugin-descriptor-2.2.1.pom
  1414. Progress (1): 2.1 kB
  1415.  
  1416. Downloaded from central: https://repo.maven.apache.org/maven2/org/apache/maven/maven-plugin-descriptor/2.2.1/maven-plugin-descriptor-2.2.1.pom (2.1 kB at 3.7 kB/s)
  1417. Downloading from central: https://repo.maven.apache.org/maven2/org/apache/maven/maven-monitor/2.2.1/maven-monitor-2.2.1.pom
  1418. Progress (1): 1.3 kB
  1419.  
  1420. Downloaded from central: https://repo.maven.apache.org/maven2/org/apache/maven/maven-monitor/2.2.1/maven-monitor-2.2.1.pom (1.3 kB at 1.9 kB/s)
  1421. Downloading from central: https://repo.maven.apache.org/maven2/org/sonatype/plexus/plexus-sec-dispatcher/1.3/plexus-sec-dispatcher-1.3.pom
  1422. Progress (1): 3.0 kB
  1423.  
  1424. Downloaded from central: https://repo.maven.apache.org/maven2/org/sonatype/plexus/plexus-sec-dispatcher/1.3/plexus-sec-dispatcher-1.3.pom (3.0 kB at 5.1 kB/s)
  1425. Downloading from central: https://repo.maven.apache.org/maven2/org/sonatype/spice/spice-parent/12/spice-parent-12.pom
  1426. Progress (1): 4.1/6.8 kB
  1427. Progress (1): 6.8 kB
  1428.  
  1429. Downloaded from central: https://repo.maven.apache.org/maven2/org/sonatype/spice/spice-parent/12/spice-parent-12.pom (6.8 kB at 11 kB/s)
  1430. Downloading from central: https://repo.maven.apache.org/maven2/org/sonatype/forge/forge-parent/4/forge-parent-4.pom
  1431. Progress (1): 4.1/8.4 kB
  1432. Progress (1): 8.2/8.4 kB
  1433. Progress (1): 8.4 kB
  1434.  
  1435. Downloaded from central: https://repo.maven.apache.org/maven2/org/sonatype/forge/forge-parent/4/forge-parent-4.pom (8.4 kB at 14 kB/s)
  1436. Downloading from central: https://repo.maven.apache.org/maven2/org/codehaus/plexus/plexus-utils/1.5.5/plexus-utils-1.5.5.pom
  1437. Progress (1): 4.1/5.1 kB
  1438. Progress (1): 5.1 kB
  1439.  
  1440. Downloaded from central: https://repo.maven.apache.org/maven2/org/codehaus/plexus/plexus-utils/1.5.5/plexus-utils-1.5.5.pom (5.1 kB at 7.6 kB/s)
  1441. Downloading from central: https://repo.maven.apache.org/maven2/org/sonatype/plexus/plexus-cipher/1.4/plexus-cipher-1.4.pom
  1442. Progress (1): 2.1 kB
  1443.  
  1444. Downloaded from central: https://repo.maven.apache.org/maven2/org/sonatype/plexus/plexus-cipher/1.4/plexus-cipher-1.4.pom (2.1 kB at 3.7 kB/s)
  1445. Downloading from central: https://repo.maven.apache.org/maven2/org/codehaus/plexus/plexus-component-annotations/1.5.5/plexus-component-annotations-1.5.5.pom
  1446. Progress (1): 815 B
  1447.  
  1448. Downloaded from central: https://repo.maven.apache.org/maven2/org/codehaus/plexus/plexus-component-annotations/1.5.5/plexus-component-annotations-1.5.5.pom (815 B at 1.0 kB/s)
  1449. Downloading from central: https://repo.maven.apache.org/maven2/org/codehaus/plexus/plexus-containers/1.5.5/plexus-containers-1.5.5.pom
  1450. Progress (1): 4.1/4.2 kB
  1451. Progress (1): 4.2 kB
  1452.  
  1453. Downloaded from central: https://repo.maven.apache.org/maven2/org/codehaus/plexus/plexus-containers/1.5.5/plexus-containers-1.5.5.pom (4.2 kB at 6.2 kB/s)
  1454. Downloading from central: https://repo.maven.apache.org/maven2/org/codehaus/plexus/plexus/2.0.7/plexus-2.0.7.pom
  1455. Progress (1): 4.1/17 kB
  1456. Progress (1): 8.2/17 kB
  1457. Progress (1): 12/17 kB
  1458. Progress (1): 16/17 kB
  1459. Progress (1): 17 kB
  1460.  
  1461. Downloaded from central: https://repo.maven.apache.org/maven2/org/codehaus/plexus/plexus/2.0.7/plexus-2.0.7.pom (17 kB at 28 kB/s)
  1462. Downloading from central: https://repo.maven.apache.org/maven2/org/codehaus/plexus/plexus-compiler-api/2.2/plexus-compiler-api-2.2.pom
  1463. Progress (1): 865 B
  1464.  
  1465. Downloaded from central: https://repo.maven.apache.org/maven2/org/codehaus/plexus/plexus-compiler-api/2.2/plexus-compiler-api-2.2.pom (865 B at 1.5 kB/s)
  1466. Downloading from central: https://repo.maven.apache.org/maven2/org/codehaus/plexus/plexus-compiler/2.2/plexus-compiler-2.2.pom
  1467. Progress (1): 3.6 kB
  1468.  
  1469. Downloaded from central: https://repo.maven.apache.org/maven2/org/codehaus/plexus/plexus-compiler/2.2/plexus-compiler-2.2.pom (3.6 kB at 5.5 kB/s)
  1470. Downloading from central: https://repo.maven.apache.org/maven2/org/codehaus/plexus/plexus-components/1.3.1/plexus-components-1.3.1.pom
  1471. Progress (1): 3.1 kB
  1472.  
  1473. Downloaded from central: https://repo.maven.apache.org/maven2/org/codehaus/plexus/plexus-components/1.3.1/plexus-components-1.3.1.pom (3.1 kB at 5.6 kB/s)
  1474. Downloading from central: https://repo.maven.apache.org/maven2/org/codehaus/plexus/plexus/3.3.1/plexus-3.3.1.pom
  1475. Progress (1): 4.1/20 kB
  1476. Progress (1): 8.2/20 kB
  1477. Progress (1): 12/20 kB
  1478. Progress (1): 16/20 kB
  1479. Progress (1): 20 kB
  1480.  
  1481. Downloaded from central: https://repo.maven.apache.org/maven2/org/codehaus/plexus/plexus/3.3.1/plexus-3.3.1.pom (20 kB at 31 kB/s)
  1482. Downloading from central: https://repo.maven.apache.org/maven2/org/sonatype/spice/spice-parent/17/spice-parent-17.pom
  1483. Progress (1): 4.1/6.8 kB
  1484. Progress (1): 6.8 kB
  1485.  
  1486. Downloaded from central: https://repo.maven.apache.org/maven2/org/sonatype/spice/spice-parent/17/spice-parent-17.pom (6.8 kB at 8.3 kB/s)
  1487. Downloading from central: https://repo.maven.apache.org/maven2/org/sonatype/forge/forge-parent/10/forge-parent-10.pom
  1488. Progress (1): 4.1/14 kB
  1489. Progress (1): 8.2/14 kB
  1490. Progress (1): 12/14 kB
  1491. Progress (1): 14 kB
  1492.  
  1493. Downloaded from central: https://repo.maven.apache.org/maven2/org/sonatype/forge/forge-parent/10/forge-parent-10.pom (14 kB at 19 kB/s)
  1494. Downloading from central: https://repo.maven.apache.org/maven2/org/codehaus/plexus/plexus-utils/3.0.8/plexus-utils-3.0.8.pom
  1495. Progress (1): 3.1 kB
  1496.  
  1497. Downloaded from central: https://repo.maven.apache.org/maven2/org/codehaus/plexus/plexus-utils/3.0.8/plexus-utils-3.0.8.pom (3.1 kB at 5.3 kB/s)
  1498. Downloading from central: https://repo.maven.apache.org/maven2/org/codehaus/plexus/plexus/3.2/plexus-3.2.pom
  1499. Progress (1): 4.1/19 kB
  1500. Progress (1): 8.2/19 kB
  1501. Progress (1): 12/19 kB
  1502. Progress (1): 16/19 kB
  1503. Progress (1): 19 kB
  1504.  
  1505. Downloaded from central: https://repo.maven.apache.org/maven2/org/codehaus/plexus/plexus/3.2/plexus-3.2.pom (19 kB at 32 kB/s)
  1506. Downloading from central: https://repo.maven.apache.org/maven2/org/codehaus/plexus/plexus-compiler-manager/2.2/plexus-compiler-manager-2.2.pom
  1507. Progress (1): 690 B
  1508.  
  1509. Downloaded from central: https://repo.maven.apache.org/maven2/org/codehaus/plexus/plexus-compiler-manager/2.2/plexus-compiler-manager-2.2.pom (690 B at 1.2 kB/s)
  1510. Downloading from central: https://repo.maven.apache.org/maven2/org/codehaus/plexus/plexus-compiler-javac/2.2/plexus-compiler-javac-2.2.pom
  1511. Progress (1): 769 B
  1512.  
  1513. Downloaded from central: https://repo.maven.apache.org/maven2/org/codehaus/plexus/plexus-compiler-javac/2.2/plexus-compiler-javac-2.2.pom (769 B at 996 B/s)
  1514. Downloading from central: https://repo.maven.apache.org/maven2/org/codehaus/plexus/plexus-compilers/2.2/plexus-compilers-2.2.pom
  1515. Progress (1): 1.2 kB
  1516.  
  1517. Downloaded from central: https://repo.maven.apache.org/maven2/org/codehaus/plexus/plexus-compilers/2.2/plexus-compilers-2.2.pom (1.2 kB at 2.1 kB/s)
  1518. Downloading from central: https://repo.maven.apache.org/maven2/org/codehaus/plexus/plexus-container-default/1.5.5/plexus-container-default-1.5.5.pom
  1519. Progress (1): 2.8 kB
  1520.  
  1521. Downloaded from central: https://repo.maven.apache.org/maven2/org/codehaus/plexus/plexus-container-default/1.5.5/plexus-container-default-1.5.5.pom (2.8 kB at 3.8 kB/s)
  1522. Downloading from central: https://repo.maven.apache.org/maven2/org/codehaus/plexus/plexus-utils/1.4.5/plexus-utils-1.4.5.pom
  1523. Progress (1): 2.3 kB
  1524.  
  1525. Downloaded from central: https://repo.maven.apache.org/maven2/org/codehaus/plexus/plexus-utils/1.4.5/plexus-utils-1.4.5.pom (2.3 kB at 3.7 kB/s)
  1526. Downloading from central: https://repo.maven.apache.org/maven2/org/codehaus/plexus/plexus-classworlds/2.2.2/plexus-classworlds-2.2.2.pom
  1527. Progress (1): 4.0 kB
  1528.  
  1529. Downloaded from central: https://repo.maven.apache.org/maven2/org/codehaus/plexus/plexus-classworlds/2.2.2/plexus-classworlds-2.2.2.pom (4.0 kB at 5.0 kB/s)
  1530. Downloading from central: https://repo.maven.apache.org/maven2/org/apache/xbean/xbean-reflect/3.4/xbean-reflect-3.4.pom
  1531. Progress (1): 2.8 kB
  1532.  
  1533. Downloaded from central: https://repo.maven.apache.org/maven2/org/apache/xbean/xbean-reflect/3.4/xbean-reflect-3.4.pom (2.8 kB at 4.3 kB/s)
  1534. Downloading from central: https://repo.maven.apache.org/maven2/org/apache/xbean/xbean/3.4/xbean-3.4.pom
  1535. Progress (1): 4.1/19 kB
  1536. Progress (1): 8.2/19 kB
  1537. Progress (1): 12/19 kB
  1538. Progress (1): 16/19 kB
  1539. Progress (1): 19 kB
  1540.  
  1541. Downloaded from central: https://repo.maven.apache.org/maven2/org/apache/xbean/xbean/3.4/xbean-3.4.pom (19 kB at 21 kB/s)
  1542. Downloading from central: https://repo.maven.apache.org/maven2/log4j/log4j/1.2.12/log4j-1.2.12.pom
  1543. Progress (1): 145 B
  1544.  
  1545. Downloaded from central: https://repo.maven.apache.org/maven2/log4j/log4j/1.2.12/log4j-1.2.12.pom (145 B at 218 B/s)
  1546. Downloading from central: https://repo.maven.apache.org/maven2/commons-logging/commons-logging-api/1.1/commons-logging-api-1.1.pom
  1547. Progress (1): 4.1/5.3 kB
  1548. Progress (1): 5.3 kB
  1549.  
  1550. Downloaded from central: https://repo.maven.apache.org/maven2/commons-logging/commons-logging-api/1.1/commons-logging-api-1.1.pom (5.3 kB at 8.8 kB/s)
  1551. Downloading from central: https://repo.maven.apache.org/maven2/com/google/collections/google-collections/1.0/google-collections-1.0.pom
  1552. Progress (1): 2.5 kB
  1553.  
  1554. Downloaded from central: https://repo.maven.apache.org/maven2/com/google/collections/google-collections/1.0/google-collections-1.0.pom (2.5 kB at 1.3 kB/s)
  1555. Downloading from central: https://repo.maven.apache.org/maven2/com/google/google/1/google-1.pom
  1556. Progress (1): 1.6 kB
  1557.  
  1558. Downloaded from central: https://repo.maven.apache.org/maven2/com/google/google/1/google-1.pom (1.6 kB at 2.4 kB/s)
  1559. Downloading from central: https://repo.maven.apache.org/maven2/junit/junit/3.8.2/junit-3.8.2.pom
  1560. Progress (1): 747 B
  1561.  
  1562. Downloaded from central: https://repo.maven.apache.org/maven2/junit/junit/3.8.2/junit-3.8.2.pom (747 B at 1.1 kB/s)
  1563. Downloading from central: https://repo.maven.apache.org/maven2/org/apache/maven/maven-plugin-api/2.0.9/maven-plugin-api-2.0.9.jar
  1564. Downloading from central: https://repo.maven.apache.org/maven2/org/apache/maven/maven-artifact/2.0.9/maven-artifact-2.0.9.jar
  1565. Downloading from central: https://repo.maven.apache.org/maven2/org/apache/maven/maven-core/2.0.9/maven-core-2.0.9.jar
  1566. Downloading from central: https://repo.maven.apache.org/maven2/org/apache/maven/maven-settings/2.0.9/maven-settings-2.0.9.jar
  1567. Downloading from central: https://repo.maven.apache.org/maven2/org/codehaus/plexus/plexus-utils/1.5.1/plexus-utils-1.5.1.jar
  1568. Progress (1): 4.1/89 kB
  1569. Progress (1): 8.2/89 kB
  1570. Progress (1): 12/89 kB
  1571. Progress (1): 16/89 kB
  1572. Progress (1): 20/89 kB
  1573. Progress (1): 25/89 kB
  1574. Progress (1): 29/89 kB
  1575. Progress (1): 33/89 kB
  1576. Progress (2): 33/89 kB | 4.1/211 kB
  1577. Progress (2): 33/89 kB | 8.2/211 kB
  1578. Progress (3): 33/89 kB | 8.2/211 kB | 2.7/160 kB
  1579. Progress (4): 33/89 kB | 8.2/211 kB | 2.7/160 kB | 4.1/49 kB
  1580. Progress (4): 33/89 kB | 8.2/211 kB | 5.5/160 kB | 4.1/49 kB
  1581. Progress (4): 37/89 kB | 8.2/211 kB | 5.5/160 kB | 4.1/49 kB
  1582. Progress (4): 37/89 kB | 8.2/211 kB | 8.2/160 kB | 4.1/49 kB
  1583. Progress (4): 37/89 kB | 8.2/211 kB | 8.2/160 kB | 8.2/49 kB
  1584. Progress (4): 37/89 kB | 12/211 kB | 8.2/160 kB | 8.2/49 kB
  1585. Progress (4): 37/89 kB | 12/211 kB | 8.2/160 kB | 12/49 kB
  1586. Progress (4): 37/89 kB | 12/211 kB | 8.2/160 kB | 16/49 kB
  1587. Progress (4): 37/89 kB | 12/211 kB | 11/160 kB | 16/49 kB
  1588. Progress (4): 37/89 kB | 12/211 kB | 11/160 kB | 20/49 kB
  1589. Progress (4): 41/89 kB | 12/211 kB | 11/160 kB | 20/49 kB
  1590. Progress (4): 41/89 kB | 12/211 kB | 11/160 kB | 25/49 kB
  1591. Progress (4): 41/89 kB | 16/211 kB | 11/160 kB | 25/49 kB
  1592. Progress (4): 41/89 kB | 16/211 kB | 11/160 kB | 29/49 kB
  1593. Progress (4): 41/89 kB | 16/211 kB | 11/160 kB | 33/49 kB
  1594. Progress (4): 45/89 kB | 16/211 kB | 11/160 kB | 33/49 kB
  1595. Progress (4): 45/89 kB | 20/211 kB | 11/160 kB | 33/49 kB
  1596. Progress (4): 49/89 kB | 20/211 kB | 11/160 kB | 33/49 kB
  1597. Progress (4): 49/89 kB | 25/211 kB | 11/160 kB | 33/49 kB
  1598. Progress (4): 49/89 kB | 29/211 kB | 11/160 kB | 33/49 kB
  1599. Progress (4): 49/89 kB | 33/211 kB | 11/160 kB | 33/49 kB
  1600. Progress (4): 53/89 kB | 33/211 kB | 11/160 kB | 33/49 kB
  1601. Progress (4): 57/89 kB | 33/211 kB | 11/160 kB | 33/49 kB
  1602. Progress (4): 61/89 kB | 33/211 kB | 11/160 kB | 33/49 kB
  1603. Progress (4): 61/89 kB | 37/211 kB | 11/160 kB | 33/49 kB
  1604. Progress (4): 66/89 kB | 37/211 kB | 11/160 kB | 33/49 kB
  1605. Progress (4): 66/89 kB | 41/211 kB | 11/160 kB | 33/49 kB
  1606. Progress (4): 66/89 kB | 45/211 kB | 11/160 kB | 33/49 kB
  1607. Progress (4): 66/89 kB | 49/211 kB | 11/160 kB | 33/49 kB
  1608. Progress (4): 66/89 kB | 53/211 kB | 11/160 kB | 33/49 kB
  1609. Progress (4): 66/89 kB | 57/211 kB | 11/160 kB | 33/49 kB
  1610. Progress (4): 66/89 kB | 61/211 kB | 11/160 kB | 33/49 kB
  1611. Progress (4): 66/89 kB | 66/211 kB | 11/160 kB | 33/49 kB
  1612. Progress (5): 66/89 kB | 66/211 kB | 11/160 kB | 33/49 kB | 4.1/13 kB
  1613. Progress (5): 66/89 kB | 66/211 kB | 11/160 kB | 33/49 kB | 8.2/13 kB
  1614. Progress (5): 66/89 kB | 66/211 kB | 11/160 kB | 33/49 kB | 12/13 kB
  1615. Progress (5): 66/89 kB | 66/211 kB | 11/160 kB | 33/49 kB | 13 kB
  1616. Progress (5): 70/89 kB | 66/211 kB | 11/160 kB | 33/49 kB | 13 kB
  1617. Progress (5): 74/89 kB | 66/211 kB | 11/160 kB | 33/49 kB | 13 kB
  1618. Progress (5): 78/89 kB | 66/211 kB | 11/160 kB | 33/49 kB | 13 kB
  1619. Progress (5): 82/89 kB | 66/211 kB | 11/160 kB | 33/49 kB | 13 kB
  1620. Progress (5): 86/89 kB | 66/211 kB | 11/160 kB | 33/49 kB | 13 kB
  1621. Progress (5): 89 kB | 66/211 kB | 11/160 kB | 33/49 kB | 13 kB
  1622. Progress (5): 89 kB | 70/211 kB | 11/160 kB | 33/49 kB | 13 kB
  1623. Progress (5): 89 kB | 74/211 kB | 11/160 kB | 33/49 kB | 13 kB
  1624. Progress (5): 89 kB | 78/211 kB | 11/160 kB | 33/49 kB | 13 kB
  1625. Progress (5): 89 kB | 82/211 kB | 11/160 kB | 33/49 kB | 13 kB
  1626. Progress (5): 89 kB | 86/211 kB | 11/160 kB | 33/49 kB | 13 kB
  1627. Progress (5): 89 kB | 90/211 kB | 11/160 kB | 33/49 kB | 13 kB
  1628. Progress (5): 89 kB | 94/211 kB | 11/160 kB | 33/49 kB | 13 kB
  1629. Progress (5): 89 kB | 98/211 kB | 11/160 kB | 33/49 kB | 13 kB
  1630. Progress (5): 89 kB | 102/211 kB | 11/160 kB | 33/49 kB | 13 kB
  1631. Progress (5): 89 kB | 106/211 kB | 11/160 kB | 33/49 kB | 13 kB
  1632. Progress (5): 89 kB | 111/211 kB | 11/160 kB | 33/49 kB | 13 kB
  1633. Progress (5): 89 kB | 115/211 kB | 11/160 kB | 33/49 kB | 13 kB
  1634. Progress (5): 89 kB | 119/211 kB | 11/160 kB | 33/49 kB | 13 kB
  1635. Progress (5): 89 kB | 123/211 kB | 11/160 kB | 33/49 kB | 13 kB
  1636. Progress (5): 89 kB | 127/211 kB | 11/160 kB | 33/49 kB | 13 kB
  1637. Progress (5): 89 kB | 131/211 kB | 11/160 kB | 33/49 kB | 13 kB
  1638. Progress (5): 89 kB | 131/211 kB | 14/160 kB | 33/49 kB | 13 kB
  1639. Progress (5): 89 kB | 131/211 kB | 16/160 kB | 33/49 kB | 13 kB
  1640. Progress (5): 89 kB | 131/211 kB | 19/160 kB | 33/49 kB | 13 kB
  1641. Progress (5): 89 kB | 131/211 kB | 19/160 kB | 37/49 kB | 13 kB
  1642. Progress (5): 89 kB | 131/211 kB | 19/160 kB | 41/49 kB | 13 kB
  1643. Progress (5): 89 kB | 131/211 kB | 19/160 kB | 45/49 kB | 13 kB
  1644. Progress (5): 89 kB | 131/211 kB | 19/160 kB | 49 kB | 13 kB
  1645. Progress (5): 89 kB | 131/211 kB | 22/160 kB | 49 kB | 13 kB
  1646. Progress (5): 89 kB | 135/211 kB | 22/160 kB | 49 kB | 13 kB
  1647. Progress (5): 89 kB | 139/211 kB | 22/160 kB | 49 kB | 13 kB
  1648. Progress (5): 89 kB | 139/211 kB | 25/160 kB | 49 kB | 13 kB
  1649. Progress (5): 89 kB | 139/211 kB | 27/160 kB | 49 kB | 13 kB
  1650. Progress (5): 89 kB | 139/211 kB | 30/160 kB | 49 kB | 13 kB
  1651.  
  1652. Downloaded from central: https://repo.maven.apache.org/maven2/org/apache/maven/maven-settings/2.0.9/maven-settings-2.0.9.jar (49 kB at 48 kB/s)
  1653. Progress (4): 89 kB | 143/211 kB | 30/160 kB | 13 kB
  1654.  
  1655. Downloading from central: https://repo.maven.apache.org/maven2/org/apache/maven/maven-plugin-parameter-documenter/2.0.9/maven-plugin-parameter-documenter-2.0.9.jar
  1656. Progress (4): 89 kB | 143/211 kB | 33/160 kB | 13 kB
  1657.  
  1658. Downloaded from central: https://repo.maven.apache.org/maven2/org/apache/maven/maven-artifact/2.0.9/maven-artifact-2.0.9.jar (89 kB at 87 kB/s)
  1659. Downloading from central: https://repo.maven.apache.org/maven2/org/apache/maven/maven-profile/2.0.9/maven-profile-2.0.9.jar
  1660. Downloaded from central: https://repo.maven.apache.org/maven2/org/apache/maven/maven-plugin-api/2.0.9/maven-plugin-api-2.0.9.jar (13 kB at 13 kB/s)
  1661. Progress (2): 147/211 kB | 33/160 kB
  1662.  
  1663. Downloading from central: https://repo.maven.apache.org/maven2/org/apache/maven/maven-model/2.0.9/maven-model-2.0.9.jar
  1664. Progress (2): 152/211 kB | 33/160 kB
  1665. Progress (2): 156/211 kB | 33/160 kB
  1666. Progress (2): 160/211 kB | 33/160 kB
  1667. Progress (2): 164/211 kB | 33/160 kB
  1668. Progress (2): 168/211 kB | 33/160 kB
  1669. Progress (2): 172/211 kB | 33/160 kB
  1670. Progress (2): 176/211 kB | 33/160 kB
  1671. Progress (2): 180/211 kB | 33/160 kB
  1672. Progress (2): 184/211 kB | 33/160 kB
  1673. Progress (2): 188/211 kB | 33/160 kB
  1674. Progress (2): 193/211 kB | 33/160 kB
  1675. Progress (2): 197/211 kB | 33/160 kB
  1676. Progress (2): 201/211 kB | 33/160 kB
  1677. Progress (2): 205/211 kB | 33/160 kB
  1678. Progress (2): 209/211 kB | 33/160 kB
  1679. Progress (2): 211 kB | 33/160 kB
  1680. Progress (2): 211 kB | 36/160 kB
  1681. Progress (2): 211 kB | 38/160 kB
  1682. Progress (2): 211 kB | 41/160 kB
  1683. Progress (2): 211 kB | 44/160 kB
  1684. Progress (3): 211 kB | 44/160 kB | 4.1/21 kB
  1685. Progress (3): 211 kB | 44/160 kB | 8.2/21 kB
  1686. Progress (3): 211 kB | 44/160 kB | 12/21 kB
  1687. Progress (3): 211 kB | 44/160 kB | 16/21 kB
  1688. Progress (3): 211 kB | 47/160 kB | 16/21 kB
  1689. Progress (3): 211 kB | 47/160 kB | 20/21 kB
  1690. Progress (3): 211 kB | 47/160 kB | 21 kB
  1691. Progress (4): 211 kB | 47/160 kB | 21 kB | 4.1/87 kB
  1692. Progress (4): 211 kB | 47/160 kB | 21 kB | 8.2/87 kB
  1693. Progress (4): 211 kB | 47/160 kB | 21 kB | 12/87 kB
  1694. Progress (4): 211 kB | 47/160 kB | 21 kB | 16/87 kB
  1695. Progress (4): 211 kB | 47/160 kB | 21 kB | 20/87 kB
  1696. Progress (4): 211 kB | 47/160 kB | 21 kB | 25/87 kB
  1697. Progress (4): 211 kB | 47/160 kB | 21 kB | 29/87 kB
  1698. Progress (4): 211 kB | 47/160 kB | 21 kB | 33/87 kB
  1699. Progress (4): 211 kB | 47/160 kB | 21 kB | 37/87 kB
  1700. Progress (4): 211 kB | 47/160 kB | 21 kB | 41/87 kB
  1701. Progress (4): 211 kB | 47/160 kB | 21 kB | 45/87 kB
  1702. Progress (4): 211 kB | 47/160 kB | 21 kB | 49/87 kB
  1703. Progress (4): 211 kB | 47/160 kB | 21 kB | 53/87 kB
  1704. Progress (4): 211 kB | 47/160 kB | 21 kB | 57/87 kB
  1705.  
  1706. Downloaded from central: https://repo.maven.apache.org/maven2/org/codehaus/plexus/plexus-utils/1.5.1/plexus-utils-1.5.1.jar (211 kB at 156 kB/s)
  1707. Downloading from central: https://repo.maven.apache.org/maven2/org/apache/maven/maven-repository-metadata/2.0.9/maven-repository-metadata-2.0.9.jar
  1708. Progress (3): 47/160 kB | 21 kB | 61/87 kB
  1709. Progress (3): 47/160 kB | 21 kB | 66/87 kB
  1710. Progress (3): 49/160 kB | 21 kB | 66/87 kB
  1711. Progress (3): 52/160 kB | 21 kB | 66/87 kB
  1712. Progress (4): 52/160 kB | 21 kB | 66/87 kB | 4.1/35 kB
  1713. Progress (4): 55/160 kB | 21 kB | 66/87 kB | 4.1/35 kB
  1714. Progress (4): 55/160 kB | 21 kB | 66/87 kB | 8.2/35 kB
  1715. Progress (4): 58/160 kB | 21 kB | 66/87 kB | 8.2/35 kB
  1716. Progress (4): 58/160 kB | 21 kB | 66/87 kB | 12/35 kB
  1717. Progress (4): 58/160 kB | 21 kB | 66/87 kB | 16/35 kB
  1718. Progress (4): 58/160 kB | 21 kB | 70/87 kB | 16/35 kB
  1719. Progress (4): 58/160 kB | 21 kB | 74/87 kB | 16/35 kB
  1720. Progress (4): 58/160 kB | 21 kB | 78/87 kB | 16/35 kB
  1721. Progress (4): 58/160 kB | 21 kB | 82/87 kB | 16/35 kB
  1722. Progress (4): 58/160 kB | 21 kB | 86/87 kB | 16/35 kB
  1723. Progress (4): 58/160 kB | 21 kB | 87 kB | 16/35 kB
  1724.  
  1725. Downloaded from central: https://repo.maven.apache.org/maven2/org/apache/maven/maven-plugin-parameter-documenter/2.0.9/maven-plugin-parameter-documenter-2.0.9.jar (21 kB at 13 kB/s)
  1726. Downloading from central: https://repo.maven.apache.org/maven2/org/apache/maven/maven-error-diagnostics/2.0.9/maven-error-diagnostics-2.0.9.jar
  1727. Progress (4): 58/160 kB | 87 kB | 16/35 kB | 4.1/25 kB
  1728. Progress (4): 58/160 kB | 87 kB | 16/35 kB | 8.2/25 kB
  1729. Progress (4): 58/160 kB | 87 kB | 16/35 kB | 12/25 kB
  1730. Progress (4): 58/160 kB | 87 kB | 16/35 kB | 16/25 kB
  1731. Progress (4): 58/160 kB | 87 kB | 16/35 kB | 20/25 kB
  1732. Progress (4): 58/160 kB | 87 kB | 16/35 kB | 25 kB
  1733. Progress (4): 60/160 kB | 87 kB | 16/35 kB | 25 kB
  1734. Progress (4): 60/160 kB | 87 kB | 20/35 kB | 25 kB
  1735. Progress (4): 60/160 kB | 87 kB | 25/35 kB | 25 kB
  1736. Progress (4): 60/160 kB | 87 kB | 29/35 kB | 25 kB
  1737. Progress (4): 60/160 kB | 87 kB | 33/35 kB | 25 kB
  1738. Progress (4): 60/160 kB | 87 kB | 35 kB | 25 kB
  1739. Progress (4): 63/160 kB | 87 kB | 35 kB | 25 kB
  1740. Progress (4): 66/160 kB | 87 kB | 35 kB | 25 kB
  1741.  
  1742. Downloaded from central: https://repo.maven.apache.org/maven2/org/apache/maven/maven-model/2.0.9/maven-model-2.0.9.jar (87 kB at 45 kB/s)
  1743. Progress (4): 66/160 kB | 35 kB | 25 kB | 4.1/14 kB
  1744.  
  1745. Downloading from central: https://repo.maven.apache.org/maven2/org/apache/maven/maven-project/2.0.9/maven-project-2.0.9.jar
  1746. Downloaded from central: https://repo.maven.apache.org/maven2/org/apache/maven/maven-repository-metadata/2.0.9/maven-repository-metadata-2.0.9.jar (25 kB at 13 kB/s)
  1747. Progress (3): 66/160 kB | 35 kB | 8.2/14 kB
  1748. Progress (3): 66/160 kB | 35 kB | 12/14 kB
  1749.  
  1750. Downloading from central: https://repo.maven.apache.org/maven2/org/apache/maven/maven-plugin-registry/2.0.9/maven-plugin-registry-2.0.9.jar
  1751. Progress (3): 66/160 kB | 35 kB | 14 kB
  1752. Progress (3): 69/160 kB | 35 kB | 14 kB
  1753. Progress (3): 71/160 kB | 35 kB | 14 kB
  1754. Progress (3): 74/160 kB | 35 kB | 14 kB
  1755. Progress (3): 77/160 kB | 35 kB | 14 kB
  1756.  
  1757. Downloaded from central: https://repo.maven.apache.org/maven2/org/apache/maven/maven-profile/2.0.9/maven-profile-2.0.9.jar (35 kB at 16 kB/s)
  1758. Downloading from central: https://repo.maven.apache.org/maven2/org/apache/maven/maven-plugin-descriptor/2.0.9/maven-plugin-descriptor-2.0.9.jar
  1759. Progress (3): 77/160 kB | 14 kB | 4.1/122 kB
  1760. Progress (3): 77/160 kB | 14 kB | 8.2/122 kB
  1761. Progress (3): 77/160 kB | 14 kB | 12/122 kB
  1762. Progress (3): 77/160 kB | 14 kB | 16/122 kB
  1763. Progress (3): 77/160 kB | 14 kB | 20/122 kB
  1764. Progress (3): 77/160 kB | 14 kB | 25/122 kB
  1765. Progress (3): 77/160 kB | 14 kB | 29/122 kB
  1766. Progress (3): 77/160 kB | 14 kB | 33/122 kB
  1767. Progress (3): 77/160 kB | 14 kB | 37/122 kB
  1768. Progress (3): 77/160 kB | 14 kB | 41/122 kB
  1769. Progress (3): 77/160 kB | 14 kB | 45/122 kB
  1770. Progress (3): 77/160 kB | 14 kB | 49/122 kB
  1771. Progress (3): 77/160 kB | 14 kB | 53/122 kB
  1772. Progress (3): 77/160 kB | 14 kB | 57/122 kB
  1773. Progress (3): 77/160 kB | 14 kB | 61/122 kB
  1774. Progress (3): 77/160 kB | 14 kB | 66/122 kB
  1775. Progress (4): 77/160 kB | 14 kB | 66/122 kB | 4.1/29 kB
  1776. Progress (4): 77/160 kB | 14 kB | 66/122 kB | 8.2/29 kB
  1777. Progress (4): 77/160 kB | 14 kB | 66/122 kB | 12/29 kB
  1778. Progress (4): 77/160 kB | 14 kB | 66/122 kB | 16/29 kB
  1779.  
  1780. Downloaded from central: https://repo.maven.apache.org/maven2/org/apache/maven/maven-error-diagnostics/2.0.9/maven-error-diagnostics-2.0.9.jar (14 kB at 6.1 kB/s)
  1781. Downloading from central: https://repo.maven.apache.org/maven2/org/apache/maven/maven-artifact-manager/2.0.9/maven-artifact-manager-2.0.9.jar
  1782. Progress (3): 77/160 kB | 66/122 kB | 20/29 kB
  1783. Progress (3): 77/160 kB | 66/122 kB | 25/29 kB
  1784. Progress (3): 77/160 kB | 66/122 kB | 29/29 kB
  1785. Progress (3): 77/160 kB | 66/122 kB | 29 kB
  1786. Progress (3): 80/160 kB | 66/122 kB | 29 kB
  1787. Progress (3): 82/160 kB | 66/122 kB | 29 kB
  1788. Progress (3): 85/160 kB | 66/122 kB | 29 kB
  1789. Progress (3): 85/160 kB | 70/122 kB | 29 kB
  1790. Progress (3): 85/160 kB | 74/122 kB | 29 kB
  1791. Progress (3): 85/160 kB | 78/122 kB | 29 kB
  1792. Progress (3): 85/160 kB | 82/122 kB | 29 kB
  1793. Progress (3): 85/160 kB | 86/122 kB | 29 kB
  1794. Progress (3): 85/160 kB | 90/122 kB | 29 kB
  1795. Progress (3): 85/160 kB | 94/122 kB | 29 kB
  1796. Progress (3): 85/160 kB | 98/122 kB | 29 kB
  1797. Progress (3): 85/160 kB | 102/122 kB | 29 kB
  1798. Progress (3): 85/160 kB | 106/122 kB | 29 kB
  1799. Progress (3): 85/160 kB | 111/122 kB | 29 kB
  1800. Progress (3): 85/160 kB | 115/122 kB | 29 kB
  1801. Progress (3): 85/160 kB | 119/122 kB | 29 kB
  1802. Progress (3): 85/160 kB | 122 kB | 29 kB
  1803. Progress (4): 85/160 kB | 122 kB | 29 kB | 4.1/58 kB
  1804. Progress (4): 85/160 kB | 122 kB | 29 kB | 8.2/58 kB
  1805. Progress (4): 85/160 kB | 122 kB | 29 kB | 12/58 kB
  1806. Progress (4): 85/160 kB | 122 kB | 29 kB | 16/58 kB
  1807. Progress (4): 85/160 kB | 122 kB | 29 kB | 20/58 kB
  1808. Progress (4): 85/160 kB | 122 kB | 29 kB | 25/58 kB
  1809. Progress (4): 85/160 kB | 122 kB | 29 kB | 29/58 kB
  1810. Progress (4): 85/160 kB | 122 kB | 29 kB | 33/58 kB
  1811. Progress (4): 85/160 kB | 122 kB | 29 kB | 37/58 kB
  1812. Progress (4): 85/160 kB | 122 kB | 29 kB | 41/58 kB
  1813. Progress (4): 85/160 kB | 122 kB | 29 kB | 45/58 kB
  1814. Progress (4): 85/160 kB | 122 kB | 29 kB | 49/58 kB
  1815. Progress (4): 85/160 kB | 122 kB | 29 kB | 53/58 kB
  1816. Progress (4): 85/160 kB | 122 kB | 29 kB | 57/58 kB
  1817. Progress (4): 85/160 kB | 122 kB | 29 kB | 58 kB
  1818.  
  1819. Downloaded from central: https://repo.maven.apache.org/maven2/org/apache/maven/maven-plugin-registry/2.0.9/maven-plugin-registry-2.0.9.jar (29 kB at 11 kB/s)
  1820. Downloading from central: https://repo.maven.apache.org/maven2/org/apache/maven/maven-monitor/2.0.9/maven-monitor-2.0.9.jar
  1821. Progress (3): 88/160 kB | 122 kB | 58 kB
  1822. Progress (4): 88/160 kB | 122 kB | 58 kB | 4.1/37 kB
  1823. Progress (4): 88/160 kB | 122 kB | 58 kB | 8.2/37 kB
  1824. Progress (4): 90/160 kB | 122 kB | 58 kB | 8.2/37 kB
  1825. Progress (4): 90/160 kB | 122 kB | 58 kB | 12/37 kB
  1826. Progress (4): 93/160 kB | 122 kB | 58 kB | 12/37 kB
  1827. Progress (4): 93/160 kB | 122 kB | 58 kB | 16/37 kB
  1828. Progress (4): 96/160 kB | 122 kB | 58 kB | 16/37 kB
  1829. Progress (4): 99/160 kB | 122 kB | 58 kB | 16/37 kB
  1830.  
  1831. Downloaded from central: https://repo.maven.apache.org/maven2/org/apache/maven/maven-project/2.0.9/maven-project-2.0.9.jar (122 kB at 43 kB/s)
  1832. Downloading from central: https://repo.maven.apache.org/maven2/org/apache/maven/maven-toolchain/1.0/maven-toolchain-1.0.jar
  1833. Downloaded from central: https://repo.maven.apache.org/maven2/org/apache/maven/maven-artifact-manager/2.0.9/maven-artifact-manager-2.0.9.jar (58 kB at 20 kB/s)
  1834. Downloading from central: https://repo.maven.apache.org/maven2/org/apache/maven/shared/maven-shared-utils/0.1/maven-shared-utils-0.1.jar
  1835. Progress (3): 99/160 kB | 16/37 kB | 4.1/10 kB
  1836. Progress (3): 99/160 kB | 16/37 kB | 8.2/10 kB
  1837. Progress (3): 99/160 kB | 16/37 kB | 10 kB
  1838. Progress (3): 101/160 kB | 16/37 kB | 10 kB
  1839. Progress (3): 101/160 kB | 20/37 kB | 10 kB
  1840. Progress (3): 101/160 kB | 25/37 kB | 10 kB
  1841. Progress (3): 104/160 kB | 25/37 kB | 10 kB
  1842. Progress (3): 104/160 kB | 29/37 kB | 10 kB
  1843. Progress (3): 107/160 kB | 29/37 kB | 10 kB
  1844. Progress (3): 107/160 kB | 33/37 kB | 10 kB
  1845. Progress (3): 107/160 kB | 37/37 kB | 10 kB
  1846. Progress (3): 107/160 kB | 37 kB | 10 kB
  1847. Progress (4): 107/160 kB | 37 kB | 10 kB | 4.1/33 kB
  1848. Progress (4): 107/160 kB | 37 kB | 10 kB | 8.2/33 kB
  1849. Progress (4): 107/160 kB | 37 kB | 10 kB | 12/33 kB
  1850.  
  1851. Downloaded from central: https://repo.maven.apache.org/maven2/org/apache/maven/maven-monitor/2.0.9/maven-monitor-2.0.9.jar (10 kB at 3.1 kB/s)
  1852. Progress (3): 107/160 kB | 37 kB | 16/33 kB
  1853. Progress (4): 107/160 kB | 37 kB | 16/33 kB | 4.1/155 kB
  1854.  
  1855. Downloading from central: https://repo.maven.apache.org/maven2/com/google/code/findbugs/jsr305/2.0.1/jsr305-2.0.1.jar
  1856. Progress (4): 107/160 kB | 37 kB | 20/33 kB | 4.1/155 kB
  1857. Progress (4): 107/160 kB | 37 kB | 20/33 kB | 8.2/155 kB
  1858. Progress (4): 107/160 kB | 37 kB | 25/33 kB | 8.2/155 kB
  1859. Progress (4): 107/160 kB | 37 kB | 25/33 kB | 12/155 kB
  1860. Progress (4): 107/160 kB | 37 kB | 29/33 kB | 12/155 kB
  1861. Progress (4): 107/160 kB | 37 kB | 29/33 kB | 16/155 kB
  1862. Progress (4): 107/160 kB | 37 kB | 33/33 kB | 16/155 kB
  1863. Progress (4): 107/160 kB | 37 kB | 33 kB | 16/155 kB
  1864. Progress (4): 107/160 kB | 37 kB | 33 kB | 20/155 kB
  1865. Progress (4): 107/160 kB | 37 kB | 33 kB | 25/155 kB
  1866. Progress (4): 107/160 kB | 37 kB | 33 kB | 29/155 kB
  1867. Progress (4): 107/160 kB | 37 kB | 33 kB | 33/155 kB
  1868. Progress (4): 107/160 kB | 37 kB | 33 kB | 37/155 kB
  1869. Progress (4): 107/160 kB | 37 kB | 33 kB | 41/155 kB
  1870. Progress (4): 107/160 kB | 37 kB | 33 kB | 45/155 kB
  1871. Progress (4): 107/160 kB | 37 kB | 33 kB | 49/155 kB
  1872. Progress (4): 107/160 kB | 37 kB | 33 kB | 53/155 kB
  1873. Progress (4): 107/160 kB | 37 kB | 33 kB | 57/155 kB
  1874. Progress (4): 107/160 kB | 37 kB | 33 kB | 61/155 kB
  1875. Progress (4): 107/160 kB | 37 kB | 33 kB | 66/155 kB
  1876. Progress (4): 110/160 kB | 37 kB | 33 kB | 66/155 kB
  1877. Progress (4): 112/160 kB | 37 kB | 33 kB | 66/155 kB
  1878. Progress (4): 115/160 kB | 37 kB | 33 kB | 66/155 kB
  1879.  
  1880. Downloaded from central: https://repo.maven.apache.org/maven2/org/apache/maven/maven-plugin-descriptor/2.0.9/maven-plugin-descriptor-2.0.9.jar (37 kB at 10 kB/s)
  1881. Downloading from central: https://repo.maven.apache.org/maven2/org/apache/maven/shared/maven-shared-incremental/1.1/maven-shared-incremental-1.1.jar
  1882. Progress (4): 115/160 kB | 33 kB | 66/155 kB | 4.1/32 kB
  1883. Progress (4): 115/160 kB | 33 kB | 66/155 kB | 8.2/32 kB
  1884. Progress (4): 115/160 kB | 33 kB | 66/155 kB | 12/32 kB
  1885.  
  1886. Downloaded from central: https://repo.maven.apache.org/maven2/org/apache/maven/maven-toolchain/1.0/maven-toolchain-1.0.jar (33 kB at 9.1 kB/s)
  1887. Downloading from central: https://repo.maven.apache.org/maven2/org/codehaus/plexus/plexus-component-annotations/1.5.5/plexus-component-annotations-1.5.5.jar
  1888. Progress (3): 115/160 kB | 66/155 kB | 16/32 kB
  1889. Progress (3): 118/160 kB | 66/155 kB | 16/32 kB
  1890. Progress (3): 121/160 kB | 66/155 kB | 16/32 kB
  1891. Progress (3): 121/160 kB | 70/155 kB | 16/32 kB
  1892. Progress (3): 121/160 kB | 74/155 kB | 16/32 kB
  1893. Progress (3): 121/160 kB | 78/155 kB | 16/32 kB
  1894. Progress (3): 121/160 kB | 82/155 kB | 16/32 kB
  1895. Progress (3): 121/160 kB | 86/155 kB | 16/32 kB
  1896. Progress (3): 121/160 kB | 90/155 kB | 16/32 kB
  1897. Progress (3): 121/160 kB | 94/155 kB | 16/32 kB
  1898. Progress (3): 121/160 kB | 98/155 kB | 16/32 kB
  1899. Progress (3): 121/160 kB | 102/155 kB | 16/32 kB
  1900. Progress (3): 121/160 kB | 106/155 kB | 16/32 kB
  1901. Progress (3): 121/160 kB | 111/155 kB | 16/32 kB
  1902. Progress (3): 121/160 kB | 115/155 kB | 16/32 kB
  1903. Progress (3): 123/160 kB | 115/155 kB | 16/32 kB
  1904. Progress (3): 123/160 kB | 119/155 kB | 16/32 kB
  1905. Progress (3): 123/160 kB | 123/155 kB | 16/32 kB
  1906. Progress (3): 123/160 kB | 127/155 kB | 16/32 kB
  1907. Progress (3): 123/160 kB | 131/155 kB | 16/32 kB
  1908. Progress (3): 123/160 kB | 135/155 kB | 16/32 kB
  1909. Progress (3): 123/160 kB | 139/155 kB | 16/32 kB
  1910. Progress (3): 123/160 kB | 143/155 kB | 16/32 kB
  1911. Progress (3): 123/160 kB | 147/155 kB | 16/32 kB
  1912. Progress (3): 123/160 kB | 152/155 kB | 16/32 kB
  1913. Progress (3): 123/160 kB | 155 kB | 16/32 kB
  1914. Progress (4): 123/160 kB | 155 kB | 16/32 kB | 4.1/14 kB
  1915. Progress (4): 123/160 kB | 155 kB | 16/32 kB | 8.2/14 kB
  1916. Progress (4): 123/160 kB | 155 kB | 16/32 kB | 12/14 kB
  1917. Progress (4): 123/160 kB | 155 kB | 16/32 kB | 14 kB
  1918. Progress (4): 123/160 kB | 155 kB | 20/32 kB | 14 kB
  1919. Progress (4): 123/160 kB | 155 kB | 25/32 kB | 14 kB
  1920. Progress (4): 123/160 kB | 155 kB | 29/32 kB | 14 kB
  1921. Progress (4): 123/160 kB | 155 kB | 32 kB | 14 kB
  1922. Progress (5): 123/160 kB | 155 kB | 32 kB | 14 kB | 4.1/4.2 kB
  1923. Progress (5): 123/160 kB | 155 kB | 32 kB | 14 kB | 4.2 kB
  1924. Progress (5): 126/160 kB | 155 kB | 32 kB | 14 kB | 4.2 kB
  1925. Progress (5): 129/160 kB | 155 kB | 32 kB | 14 kB | 4.2 kB
  1926. Progress (5): 132/160 kB | 155 kB | 32 kB | 14 kB | 4.2 kB
  1927. Progress (5): 134/160 kB | 155 kB | 32 kB | 14 kB | 4.2 kB
  1928.  
  1929. Downloaded from central: https://repo.maven.apache.org/maven2/org/apache/maven/shared/maven-shared-utils/0.1/maven-shared-utils-0.1.jar (155 kB at 37 kB/s)
  1930. Downloading from central: https://repo.maven.apache.org/maven2/org/codehaus/plexus/plexus-compiler-api/2.2/plexus-compiler-api-2.2.jar
  1931. Downloaded from central: https://repo.maven.apache.org/maven2/org/apache/maven/shared/maven-shared-incremental/1.1/maven-shared-incremental-1.1.jar (14 kB at 3.2 kB/s)
  1932. Downloading from central: https://repo.maven.apache.org/maven2/org/codehaus/plexus/plexus-compiler-manager/2.2/plexus-compiler-manager-2.2.jar
  1933. Downloaded from central: https://repo.maven.apache.org/maven2/org/codehaus/plexus/plexus-component-annotations/1.5.5/plexus-component-annotations-1.5.5.jar (4.2 kB at 999 B/s)
  1934. Downloaded from central: https://repo.maven.apache.org/maven2/com/google/code/findbugs/jsr305/2.0.1/jsr305-2.0.1.jar (32 kB at 7.6 kB/s)
  1935. Downloading from central: https://repo.maven.apache.org/maven2/org/codehaus/plexus/plexus-container-default/1.5.5/plexus-container-default-1.5.5.jar
  1936. Downloading from central: https://repo.maven.apache.org/maven2/org/codehaus/plexus/plexus-compiler-javac/2.2/plexus-compiler-javac-2.2.jar
  1937. Progress (1): 137/160 kB
  1938. Progress (1): 140/160 kB
  1939. Progress (1): 143/160 kB
  1940. Progress (1): 145/160 kB
  1941. Progress (1): 148/160 kB
  1942. Progress (2): 148/160 kB | 4.1/25 kB
  1943. Progress (2): 148/160 kB | 8.2/25 kB
  1944. Progress (2): 148/160 kB | 12/25 kB
  1945. Progress (3): 148/160 kB | 12/25 kB | 4.1/4.6 kB
  1946. Progress (3): 148/160 kB | 12/25 kB | 4.6 kB
  1947. Progress (4): 148/160 kB | 12/25 kB | 4.6 kB | 4.1/19 kB
  1948. Progress (4): 148/160 kB | 16/25 kB | 4.6 kB | 4.1/19 kB
  1949. Progress (4): 148/160 kB | 16/25 kB | 4.6 kB | 8.2/19 kB
  1950. Progress (4): 148/160 kB | 16/25 kB | 4.6 kB | 12/19 kB
  1951. Progress (4): 148/160 kB | 20/25 kB | 4.6 kB | 12/19 kB
  1952. Progress (4): 148/160 kB | 20/25 kB | 4.6 kB | 16/19 kB
  1953. Progress (5): 148/160 kB | 20/25 kB | 4.6 kB | 16/19 kB | 4.1/217 kB
  1954. Progress (5): 148/160 kB | 20/25 kB | 4.6 kB | 19 kB | 4.1/217 kB
  1955. Progress (5): 148/160 kB | 25/25 kB | 4.6 kB | 19 kB | 4.1/217 kB
  1956. Progress (5): 148/160 kB | 25/25 kB | 4.6 kB | 19 kB | 8.2/217 kB
  1957. Progress (5): 148/160 kB | 25 kB | 4.6 kB | 19 kB | 8.2/217 kB
  1958. Progress (5): 148/160 kB | 25 kB | 4.6 kB | 19 kB | 12/217 kB
  1959. Progress (5): 148/160 kB | 25 kB | 4.6 kB | 19 kB | 16/217 kB
  1960. Progress (5): 148/160 kB | 25 kB | 4.6 kB | 19 kB | 20/217 kB
  1961. Progress (5): 148/160 kB | 25 kB | 4.6 kB | 19 kB | 25/217 kB
  1962. Progress (5): 148/160 kB | 25 kB | 4.6 kB | 19 kB | 29/217 kB
  1963. Progress (5): 148/160 kB | 25 kB | 4.6 kB | 19 kB | 33/217 kB
  1964. Progress (5): 151/160 kB | 25 kB | 4.6 kB | 19 kB | 33/217 kB
  1965. Progress (5): 154/160 kB | 25 kB | 4.6 kB | 19 kB | 33/217 kB
  1966. Progress (5): 156/160 kB | 25 kB | 4.6 kB | 19 kB | 33/217 kB
  1967. Progress (5): 156/160 kB | 25 kB | 4.6 kB | 19 kB | 37/217 kB
  1968. Progress (5): 156/160 kB | 25 kB | 4.6 kB | 19 kB | 41/217 kB
  1969. Progress (5): 156/160 kB | 25 kB | 4.6 kB | 19 kB | 45/217 kB
  1970. Progress (5): 156/160 kB | 25 kB | 4.6 kB | 19 kB | 49/217 kB
  1971.  
  1972. Downloaded from central: https://repo.maven.apache.org/maven2/org/codehaus/plexus/plexus-compiler-javac/2.2/plexus-compiler-javac-2.2.jar (19 kB at 3.8 kB/s)
  1973. Downloading from central: https://repo.maven.apache.org/maven2/org/codehaus/plexus/plexus-classworlds/2.2.2/plexus-classworlds-2.2.2.jar
  1974. Downloaded from central: https://repo.maven.apache.org/maven2/org/codehaus/plexus/plexus-compiler-api/2.2/plexus-compiler-api-2.2.jar (25 kB at 5.0 kB/s)
  1975. Downloading from central: https://repo.maven.apache.org/maven2/org/apache/xbean/xbean-reflect/3.4/xbean-reflect-3.4.jar
  1976. Downloaded from central: https://repo.maven.apache.org/maven2/org/codehaus/plexus/plexus-compiler-manager/2.2/plexus-compiler-manager-2.2.jar (4.6 kB at 907 B/s)
  1977. Downloading from central: https://repo.maven.apache.org/maven2/log4j/log4j/1.2.12/log4j-1.2.12.jar
  1978. Progress (2): 156/160 kB | 53/217 kB
  1979. Progress (2): 156/160 kB | 57/217 kB
  1980. Progress (2): 156/160 kB | 61/217 kB
  1981. Progress (2): 156/160 kB | 66/217 kB
  1982. Progress (2): 156/160 kB | 70/217 kB
  1983. Progress (2): 156/160 kB | 74/217 kB
  1984. Progress (2): 156/160 kB | 78/217 kB
  1985. Progress (2): 156/160 kB | 82/217 kB
  1986. Progress (2): 156/160 kB | 86/217 kB
  1987. Progress (2): 156/160 kB | 90/217 kB
  1988. Progress (2): 156/160 kB | 94/217 kB
  1989. Progress (2): 156/160 kB | 98/217 kB
  1990. Progress (2): 159/160 kB | 98/217 kB
  1991. Progress (2): 160 kB | 98/217 kB
  1992. Progress (2): 160 kB | 102/217 kB
  1993. Progress (2): 160 kB | 106/217 kB
  1994. Progress (2): 160 kB | 111/217 kB
  1995. Progress (2): 160 kB | 115/217 kB
  1996. Progress (2): 160 kB | 119/217 kB
  1997. Progress (2): 160 kB | 123/217 kB
  1998. Progress (2): 160 kB | 127/217 kB
  1999. Progress (2): 160 kB | 131/217 kB
  2000. Progress (2): 160 kB | 135/217 kB
  2001. Progress (2): 160 kB | 139/217 kB
  2002. Progress (2): 160 kB | 143/217 kB
  2003. Progress (2): 160 kB | 147/217 kB
  2004. Progress (3): 160 kB | 147/217 kB | 4.1/46 kB
  2005. Progress (3): 160 kB | 147/217 kB | 8.2/46 kB
  2006. Progress (3): 160 kB | 147/217 kB | 12/46 kB
  2007. Progress (3): 160 kB | 147/217 kB | 16/46 kB
  2008. Progress (3): 160 kB | 147/217 kB | 20/46 kB
  2009. Progress (3): 160 kB | 147/217 kB | 25/46 kB
  2010. Progress (3): 160 kB | 147/217 kB | 29/46 kB
  2011. Progress (3): 160 kB | 147/217 kB | 33/46 kB
  2012. Progress (4): 160 kB | 147/217 kB | 33/46 kB | 4.1/134 kB
  2013. Progress (4): 160 kB | 147/217 kB | 33/46 kB | 8.2/134 kB
  2014. Progress (4): 160 kB | 147/217 kB | 33/46 kB | 12/134 kB
  2015. Progress (4): 160 kB | 147/217 kB | 33/46 kB | 16/134 kB
  2016. Progress (4): 160 kB | 147/217 kB | 33/46 kB | 20/134 kB
  2017. Progress (4): 160 kB | 147/217 kB | 33/46 kB | 25/134 kB
  2018. Progress (4): 160 kB | 147/217 kB | 33/46 kB | 29/134 kB
  2019. Progress (4): 160 kB | 147/217 kB | 33/46 kB | 33/134 kB
  2020. Progress (4): 160 kB | 147/217 kB | 33/46 kB | 37/134 kB
  2021. Progress (4): 160 kB | 147/217 kB | 33/46 kB | 41/134 kB
  2022. Progress (4): 160 kB | 147/217 kB | 33/46 kB | 45/134 kB
  2023. Progress (4): 160 kB | 147/217 kB | 33/46 kB | 49/134 kB
  2024. Progress (4): 160 kB | 147/217 kB | 33/46 kB | 53/134 kB
  2025. Progress (4): 160 kB | 147/217 kB | 33/46 kB | 57/134 kB
  2026. Progress (4): 160 kB | 147/217 kB | 33/46 kB | 61/134 kB
  2027. Progress (4): 160 kB | 147/217 kB | 33/46 kB | 66/134 kB
  2028. Progress (5): 160 kB | 147/217 kB | 33/46 kB | 66/134 kB | 4.1/358 kB
  2029. Progress (5): 160 kB | 147/217 kB | 33/46 kB | 66/134 kB | 8.2/358 kB
  2030. Progress (5): 160 kB | 147/217 kB | 33/46 kB | 66/134 kB | 12/358 kB
  2031. Progress (5): 160 kB | 147/217 kB | 33/46 kB | 66/134 kB | 16/358 kB
  2032. Progress (5): 160 kB | 152/217 kB | 33/46 kB | 66/134 kB | 16/358 kB
  2033. Progress (5): 160 kB | 156/217 kB | 33/46 kB | 66/134 kB | 16/358 kB
  2034. Progress (5): 160 kB | 160/217 kB | 33/46 kB | 66/134 kB | 16/358 kB
  2035. Progress (5): 160 kB | 164/217 kB | 33/46 kB | 66/134 kB | 16/358 kB
  2036. Progress (5): 160 kB | 168/217 kB | 33/46 kB | 66/134 kB | 16/358 kB
  2037. Progress (5): 160 kB | 172/217 kB | 33/46 kB | 66/134 kB | 16/358 kB
  2038. Progress (5): 160 kB | 176/217 kB | 33/46 kB | 66/134 kB | 16/358 kB
  2039. Progress (5): 160 kB | 180/217 kB | 33/46 kB | 66/134 kB | 16/358 kB
  2040. Progress (5): 160 kB | 184/217 kB | 33/46 kB | 66/134 kB | 16/358 kB
  2041. Progress (5): 160 kB | 188/217 kB | 33/46 kB | 66/134 kB | 16/358 kB
  2042. Progress (5): 160 kB | 193/217 kB | 33/46 kB | 66/134 kB | 16/358 kB
  2043. Progress (5): 160 kB | 197/217 kB | 33/46 kB | 66/134 kB | 16/358 kB
  2044. Progress (5): 160 kB | 201/217 kB | 33/46 kB | 66/134 kB | 16/358 kB
  2045. Progress (5): 160 kB | 205/217 kB | 33/46 kB | 66/134 kB | 16/358 kB
  2046.  
  2047. Downloaded from central: https://repo.maven.apache.org/maven2/org/apache/maven/maven-core/2.0.9/maven-core-2.0.9.jar (160 kB at 28 kB/s)
  2048. Progress (4): 205/217 kB | 37/46 kB | 66/134 kB | 16/358 kB
  2049. Progress (4): 209/217 kB | 37/46 kB | 66/134 kB | 16/358 kB
  2050. Progress (4): 209/217 kB | 41/46 kB | 66/134 kB | 16/358 kB
  2051.  
  2052. Downloading from central: https://repo.maven.apache.org/maven2/commons-logging/commons-logging-api/1.1/commons-logging-api-1.1.jar
  2053. Progress (4): 209/217 kB | 41/46 kB | 70/134 kB | 16/358 kB
  2054. Progress (4): 209/217 kB | 45/46 kB | 70/134 kB | 16/358 kB
  2055. Progress (4): 213/217 kB | 45/46 kB | 70/134 kB | 16/358 kB
  2056. Progress (4): 213/217 kB | 46 kB | 70/134 kB | 16/358 kB
  2057. Progress (4): 213/217 kB | 46 kB | 74/134 kB | 16/358 kB
  2058. Progress (4): 213/217 kB | 46 kB | 78/134 kB | 16/358 kB
  2059. Progress (4): 217 kB | 46 kB | 78/134 kB | 16/358 kB
  2060. Progress (4): 217 kB | 46 kB | 82/134 kB | 16/358 kB
  2061. Progress (4): 217 kB | 46 kB | 86/134 kB | 16/358 kB
  2062. Progress (4): 217 kB | 46 kB | 90/134 kB | 16/358 kB
  2063. Progress (4): 217 kB | 46 kB | 94/134 kB | 16/358 kB
  2064. Progress (4): 217 kB | 46 kB | 98/134 kB | 16/358 kB
  2065. Progress (4): 217 kB | 46 kB | 98/134 kB | 20/358 kB
  2066. Progress (4): 217 kB | 46 kB | 102/134 kB | 20/358 kB
  2067. Progress (4): 217 kB | 46 kB | 102/134 kB | 25/358 kB
  2068. Progress (4): 217 kB | 46 kB | 106/134 kB | 25/358 kB
  2069. Progress (4): 217 kB | 46 kB | 106/134 kB | 29/358 kB
  2070. Progress (4): 217 kB | 46 kB | 111/134 kB | 29/358 kB
  2071. Progress (4): 217 kB | 46 kB | 111/134 kB | 33/358 kB
  2072. Progress (4): 217 kB | 46 kB | 115/134 kB | 33/358 kB
  2073. Progress (4): 217 kB | 46 kB | 115/134 kB | 37/358 kB
  2074. Progress (4): 217 kB | 46 kB | 119/134 kB | 37/358 kB
  2075. Progress (4): 217 kB | 46 kB | 119/134 kB | 41/358 kB
  2076. Progress (4): 217 kB | 46 kB | 123/134 kB | 41/358 kB
  2077. Progress (4): 217 kB | 46 kB | 123/134 kB | 45/358 kB
  2078. Progress (4): 217 kB | 46 kB | 127/134 kB | 45/358 kB
  2079. Progress (4): 217 kB | 46 kB | 127/134 kB | 49/358 kB
  2080. Progress (4): 217 kB | 46 kB | 131/134 kB | 49/358 kB
  2081. Progress (4): 217 kB | 46 kB | 134 kB | 49/358 kB
  2082. Progress (4): 217 kB | 46 kB | 134 kB | 53/358 kB
  2083. Progress (4): 217 kB | 46 kB | 134 kB | 57/358 kB
  2084. Progress (4): 217 kB | 46 kB | 134 kB | 61/358 kB
  2085. Progress (4): 217 kB | 46 kB | 134 kB | 66/358 kB
  2086. Progress (4): 217 kB | 46 kB | 134 kB | 70/358 kB
  2087.  
  2088. Downloaded from central: https://repo.maven.apache.org/maven2/org/codehaus/plexus/plexus-classworlds/2.2.2/plexus-classworlds-2.2.2.jar (46 kB at 7.7 kB/s)
  2089. Progress (3): 217 kB | 134 kB | 74/358 kB
  2090. Progress (3): 217 kB | 134 kB | 78/358 kB
  2091. Progress (3): 217 kB | 134 kB | 82/358 kB
  2092.  
  2093. Downloaded from central: https://repo.maven.apache.org/maven2/org/apache/xbean/xbean-reflect/3.4/xbean-reflect-3.4.jar (134 kB at 22 kB/s)
  2094. Downloading from central: https://repo.maven.apache.org/maven2/junit/junit/3.8.2/junit-3.8.2.jar
  2095. Downloaded from central: https://repo.maven.apache.org/maven2/org/codehaus/plexus/plexus-container-default/1.5.5/plexus-container-default-1.5.5.jar (217 kB at 36 kB/s)
  2096. Downloading from central: https://repo.maven.apache.org/maven2/com/google/collections/google-collections/1.0/google-collections-1.0.jar
  2097. Progress (1): 86/358 kB
  2098. Progress (1): 90/358 kB
  2099. Progress (2): 90/358 kB | 4.1/45 kB
  2100. Progress (2): 94/358 kB | 4.1/45 kB
  2101. Progress (2): 94/358 kB | 8.2/45 kB
  2102. Progress (2): 98/358 kB | 8.2/45 kB
  2103. Progress (2): 98/358 kB | 12/45 kB
  2104. Progress (2): 98/358 kB | 16/45 kB
  2105. Progress (3): 98/358 kB | 16/45 kB | 4.1/121 kB
  2106. Progress (3): 98/358 kB | 16/45 kB | 8.2/121 kB
  2107. Progress (3): 98/358 kB | 16/45 kB | 12/121 kB
  2108. Progress (3): 98/358 kB | 16/45 kB | 16/121 kB
  2109. Progress (3): 98/358 kB | 16/45 kB | 20/121 kB
  2110. Progress (3): 98/358 kB | 16/45 kB | 25/121 kB
  2111. Progress (3): 98/358 kB | 16/45 kB | 29/121 kB
  2112. Progress (3): 98/358 kB | 16/45 kB | 33/121 kB
  2113. Progress (4): 98/358 kB | 16/45 kB | 33/121 kB | 4.1/640 kB
  2114. Progress (4): 98/358 kB | 16/45 kB | 33/121 kB | 8.2/640 kB
  2115. Progress (4): 98/358 kB | 16/45 kB | 33/121 kB | 12/640 kB
  2116. Progress (4): 98/358 kB | 16/45 kB | 33/121 kB | 16/640 kB
  2117. Progress (4): 98/358 kB | 16/45 kB | 33/121 kB | 20/640 kB
  2118. Progress (4): 98/358 kB | 16/45 kB | 33/121 kB | 25/640 kB
  2119. Progress (4): 98/358 kB | 16/45 kB | 33/121 kB | 29/640 kB
  2120. Progress (4): 98/358 kB | 16/45 kB | 33/121 kB | 33/640 kB
  2121. Progress (4): 98/358 kB | 16/45 kB | 33/121 kB | 37/640 kB
  2122. Progress (4): 98/358 kB | 16/45 kB | 33/121 kB | 41/640 kB
  2123. Progress (4): 98/358 kB | 16/45 kB | 33/121 kB | 45/640 kB
  2124. Progress (4): 98/358 kB | 16/45 kB | 33/121 kB | 49/640 kB
  2125. Progress (4): 102/358 kB | 16/45 kB | 33/121 kB | 49/640 kB
  2126. Progress (4): 106/358 kB | 16/45 kB | 33/121 kB | 49/640 kB
  2127. Progress (4): 111/358 kB | 16/45 kB | 33/121 kB | 49/640 kB
  2128. Progress (4): 115/358 kB | 16/45 kB | 33/121 kB | 49/640 kB
  2129. Progress (4): 119/358 kB | 16/45 kB | 33/121 kB | 49/640 kB
  2130. Progress (4): 123/358 kB | 16/45 kB | 33/121 kB | 49/640 kB
  2131. Progress (4): 123/358 kB | 16/45 kB | 37/121 kB | 49/640 kB
  2132. Progress (4): 127/358 kB | 16/45 kB | 37/121 kB | 49/640 kB
  2133. Progress (4): 131/358 kB | 16/45 kB | 37/121 kB | 49/640 kB
  2134. Progress (4): 131/358 kB | 16/45 kB | 37/121 kB | 53/640 kB
  2135. Progress (4): 131/358 kB | 16/45 kB | 41/121 kB | 53/640 kB
  2136. Progress (4): 131/358 kB | 16/45 kB | 41/121 kB | 57/640 kB
  2137. Progress (4): 131/358 kB | 20/45 kB | 41/121 kB | 57/640 kB
  2138. Progress (4): 131/358 kB | 20/45 kB | 41/121 kB | 61/640 kB
  2139. Progress (4): 131/358 kB | 20/45 kB | 45/121 kB | 61/640 kB
  2140. Progress (4): 131/358 kB | 20/45 kB | 45/121 kB | 66/640 kB
  2141. Progress (4): 131/358 kB | 25/45 kB | 45/121 kB | 66/640 kB
  2142. Progress (4): 131/358 kB | 25/45 kB | 49/121 kB | 66/640 kB
  2143. Progress (4): 131/358 kB | 25/45 kB | 49/121 kB | 70/640 kB
  2144. Progress (4): 131/358 kB | 29/45 kB | 49/121 kB | 70/640 kB
  2145. Progress (4): 131/358 kB | 29/45 kB | 53/121 kB | 70/640 kB
  2146. Progress (4): 131/358 kB | 29/45 kB | 53/121 kB | 74/640 kB
  2147. Progress (4): 131/358 kB | 29/45 kB | 57/121 kB | 74/640 kB
  2148. Progress (4): 131/358 kB | 33/45 kB | 57/121 kB | 74/640 kB
  2149. Progress (4): 131/358 kB | 33/45 kB | 61/121 kB | 74/640 kB
  2150. Progress (4): 131/358 kB | 33/45 kB | 61/121 kB | 78/640 kB
  2151. Progress (4): 131/358 kB | 33/45 kB | 61/121 kB | 82/640 kB
  2152. Progress (4): 131/358 kB | 33/45 kB | 66/121 kB | 82/640 kB
  2153. Progress (4): 131/358 kB | 33/45 kB | 66/121 kB | 86/640 kB
  2154. Progress (4): 131/358 kB | 33/45 kB | 66/121 kB | 90/640 kB
  2155. Progress (4): 131/358 kB | 33/45 kB | 66/121 kB | 94/640 kB
  2156. Progress (4): 131/358 kB | 33/45 kB | 66/121 kB | 98/640 kB
  2157. Progress (4): 131/358 kB | 33/45 kB | 66/121 kB | 102/640 kB
  2158. Progress (4): 131/358 kB | 33/45 kB | 66/121 kB | 106/640 kB
  2159. Progress (4): 131/358 kB | 33/45 kB | 66/121 kB | 111/640 kB
  2160. Progress (4): 131/358 kB | 33/45 kB | 66/121 kB | 115/640 kB
  2161. Progress (4): 131/358 kB | 33/45 kB | 66/121 kB | 119/640 kB
  2162. Progress (4): 131/358 kB | 33/45 kB | 66/121 kB | 123/640 kB
  2163. Progress (4): 131/358 kB | 33/45 kB | 66/121 kB | 127/640 kB
  2164. Progress (4): 131/358 kB | 33/45 kB | 66/121 kB | 131/640 kB
  2165. Progress (4): 135/358 kB | 33/45 kB | 66/121 kB | 131/640 kB
  2166. Progress (4): 139/358 kB | 33/45 kB | 66/121 kB | 131/640 kB
  2167. Progress (4): 143/358 kB | 33/45 kB | 66/121 kB | 131/640 kB
  2168. Progress (4): 147/358 kB | 33/45 kB | 66/121 kB | 131/640 kB
  2169. Progress (4): 147/358 kB | 33/45 kB | 70/121 kB | 131/640 kB
  2170. Progress (4): 147/358 kB | 33/45 kB | 74/121 kB | 131/640 kB
  2171. Progress (4): 147/358 kB | 33/45 kB | 78/121 kB | 131/640 kB
  2172. Progress (4): 147/358 kB | 33/45 kB | 82/121 kB | 131/640 kB
  2173. Progress (4): 147/358 kB | 33/45 kB | 86/121 kB | 131/640 kB
  2174. Progress (4): 147/358 kB | 33/45 kB | 90/121 kB | 131/640 kB
  2175. Progress (4): 147/358 kB | 33/45 kB | 94/121 kB | 131/640 kB
  2176. Progress (4): 147/358 kB | 33/45 kB | 98/121 kB | 131/640 kB
  2177. Progress (4): 147/358 kB | 37/45 kB | 98/121 kB | 131/640 kB
  2178. Progress (4): 147/358 kB | 41/45 kB | 98/121 kB | 131/640 kB
  2179. Progress (4): 147/358 kB | 41/45 kB | 98/121 kB | 135/640 kB
  2180. Progress (4): 147/358 kB | 45 kB | 98/121 kB | 135/640 kB
  2181. Progress (4): 147/358 kB | 45 kB | 98/121 kB | 139/640 kB
  2182. Progress (4): 147/358 kB | 45 kB | 98/121 kB | 143/640 kB
  2183. Progress (4): 147/358 kB | 45 kB | 98/121 kB | 147/640 kB
  2184. Progress (4): 147/358 kB | 45 kB | 98/121 kB | 152/640 kB
  2185. Progress (4): 147/358 kB | 45 kB | 98/121 kB | 156/640 kB
  2186. Progress (4): 152/358 kB | 45 kB | 98/121 kB | 156/640 kB
  2187. Progress (4): 152/358 kB | 45 kB | 98/121 kB | 160/640 kB
  2188. Progress (4): 156/358 kB | 45 kB | 98/121 kB | 160/640 kB
  2189. Progress (4): 156/358 kB | 45 kB | 98/121 kB | 164/640 kB
  2190. Progress (4): 160/358 kB | 45 kB | 98/121 kB | 164/640 kB
  2191. Progress (4): 164/358 kB | 45 kB | 98/121 kB | 164/640 kB
  2192. Progress (4): 164/358 kB | 45 kB | 98/121 kB | 168/640 kB
  2193. Progress (4): 164/358 kB | 45 kB | 98/121 kB | 172/640 kB
  2194. Progress (4): 164/358 kB | 45 kB | 98/121 kB | 176/640 kB
  2195. Progress (4): 164/358 kB | 45 kB | 98/121 kB | 180/640 kB
  2196. Progress (4): 164/358 kB | 45 kB | 98/121 kB | 184/640 kB
  2197. Progress (4): 164/358 kB | 45 kB | 98/121 kB | 188/640 kB
  2198. Progress (4): 164/358 kB | 45 kB | 98/121 kB | 193/640 kB
  2199. Progress (4): 164/358 kB | 45 kB | 98/121 kB | 197/640 kB
  2200. Progress (4): 168/358 kB | 45 kB | 98/121 kB | 197/640 kB
  2201. Progress (4): 172/358 kB | 45 kB | 98/121 kB | 197/640 kB
  2202. Progress (4): 172/358 kB | 45 kB | 102/121 kB | 197/640 kB
  2203. Progress (4): 172/358 kB | 45 kB | 106/121 kB | 197/640 kB
  2204. Progress (4): 176/358 kB | 45 kB | 106/121 kB | 197/640 kB
  2205. Progress (4): 180/358 kB | 45 kB | 106/121 kB | 197/640 kB
  2206. Progress (4): 180/358 kB | 45 kB | 106/121 kB | 201/640 kB
  2207. Progress (4): 180/358 kB | 45 kB | 106/121 kB | 205/640 kB
  2208. Progress (4): 180/358 kB | 45 kB | 106/121 kB | 209/640 kB
  2209. Progress (4): 180/358 kB | 45 kB | 106/121 kB | 213/640 kB
  2210. Progress (4): 180/358 kB | 45 kB | 106/121 kB | 217/640 kB
  2211. Progress (4): 180/358 kB | 45 kB | 111/121 kB | 217/640 kB
  2212. Progress (4): 180/358 kB | 45 kB | 115/121 kB | 217/640 kB
  2213. Progress (4): 180/358 kB | 45 kB | 115/121 kB | 221/640 kB
  2214. Progress (4): 180/358 kB | 45 kB | 119/121 kB | 221/640 kB
  2215. Progress (4): 180/358 kB | 45 kB | 119/121 kB | 225/640 kB
  2216. Progress (4): 180/358 kB | 45 kB | 119/121 kB | 229/640 kB
  2217. Progress (4): 180/358 kB | 45 kB | 121 kB | 229/640 kB
  2218. Progress (4): 180/358 kB | 45 kB | 121 kB | 233/640 kB
  2219. Progress (4): 180/358 kB | 45 kB | 121 kB | 238/640 kB
  2220. Progress (4): 180/358 kB | 45 kB | 121 kB | 242/640 kB
  2221. Progress (4): 180/358 kB | 45 kB | 121 kB | 246/640 kB
  2222. Progress (4): 180/358 kB | 45 kB | 121 kB | 250/640 kB
  2223.  
  2224. Downloaded from central: https://repo.maven.apache.org/maven2/commons-logging/commons-logging-api/1.1/commons-logging-api-1.1.jar (45 kB at 5.7 kB/s)
  2225. Progress (3): 180/358 kB | 121 kB | 254/640 kB
  2226. Progress (3): 180/358 kB | 121 kB | 258/640 kB
  2227. Progress (3): 180/358 kB | 121 kB | 262/640 kB
  2228. Progress (3): 180/358 kB | 121 kB | 266/640 kB
  2229. Progress (3): 184/358 kB | 121 kB | 266/640 kB
  2230. Progress (3): 188/358 kB | 121 kB | 266/640 kB
  2231. Progress (3): 193/358 kB | 121 kB | 266/640 kB
  2232. Progress (3): 197/358 kB | 121 kB | 266/640 kB
  2233. Progress (3): 201/358 kB | 121 kB | 266/640 kB
  2234. Progress (3): 205/358 kB | 121 kB | 266/640 kB
  2235. Progress (3): 209/358 kB | 121 kB | 266/640 kB
  2236. Progress (3): 209/358 kB | 121 kB | 270/640 kB
  2237. Progress (3): 209/358 kB | 121 kB | 274/640 kB
  2238. Progress (3): 209/358 kB | 121 kB | 279/640 kB
  2239. Progress (3): 209/358 kB | 121 kB | 283/640 kB
  2240. Progress (3): 213/358 kB | 121 kB | 283/640 kB
  2241. Progress (3): 213/358 kB | 121 kB | 287/640 kB
  2242. Progress (3): 213/358 kB | 121 kB | 291/640 kB
  2243. Progress (3): 213/358 kB | 121 kB | 295/640 kB
  2244. Progress (3): 213/358 kB | 121 kB | 299/640 kB
  2245. Progress (3): 217/358 kB | 121 kB | 299/640 kB
  2246. Progress (3): 217/358 kB | 121 kB | 303/640 kB
  2247. Progress (3): 217/358 kB | 121 kB | 307/640 kB
  2248. Progress (3): 217/358 kB | 121 kB | 311/640 kB
  2249. Progress (3): 217/358 kB | 121 kB | 315/640 kB
  2250.  
  2251. Downloaded from central: https://repo.maven.apache.org/maven2/junit/junit/3.8.2/junit-3.8.2.jar (121 kB at 15 kB/s)
  2252. Progress (2): 217/358 kB | 319/640 kB
  2253. Progress (2): 217/358 kB | 324/640 kB
  2254. Progress (2): 217/358 kB | 328/640 kB
  2255. Progress (2): 217/358 kB | 332/640 kB
  2256. Progress (2): 221/358 kB | 332/640 kB
  2257. Progress (2): 225/358 kB | 332/640 kB
  2258. Progress (2): 229/358 kB | 332/640 kB
  2259. Progress (2): 233/358 kB | 332/640 kB
  2260. Progress (2): 238/358 kB | 332/640 kB
  2261. Progress (2): 242/358 kB | 332/640 kB
  2262. Progress (2): 246/358 kB | 332/640 kB
  2263. Progress (2): 250/358 kB | 332/640 kB
  2264. Progress (2): 250/358 kB | 336/640 kB
  2265. Progress (2): 250/358 kB | 340/640 kB
  2266. Progress (2): 250/358 kB | 344/640 kB
  2267. Progress (2): 250/358 kB | 348/640 kB
  2268. Progress (2): 250/358 kB | 352/640 kB
  2269. Progress (2): 250/358 kB | 356/640 kB
  2270. Progress (2): 250/358 kB | 360/640 kB
  2271. Progress (2): 250/358 kB | 365/640 kB
  2272. Progress (2): 250/358 kB | 369/640 kB
  2273. Progress (2): 250/358 kB | 373/640 kB
  2274. Progress (2): 250/358 kB | 377/640 kB
  2275. Progress (2): 250/358 kB | 381/640 kB
  2276. Progress (2): 250/358 kB | 385/640 kB
  2277. Progress (2): 250/358 kB | 389/640 kB
  2278. Progress (2): 250/358 kB | 393/640 kB
  2279. Progress (2): 250/358 kB | 397/640 kB
  2280. Progress (2): 254/358 kB | 397/640 kB
  2281. Progress (2): 258/358 kB | 397/640 kB
  2282. Progress (2): 262/358 kB | 397/640 kB
  2283. Progress (2): 266/358 kB | 397/640 kB
  2284. Progress (2): 266/358 kB | 401/640 kB
  2285. Progress (2): 266/358 kB | 406/640 kB
  2286. Progress (2): 266/358 kB | 410/640 kB
  2287. Progress (2): 266/358 kB | 414/640 kB
  2288. Progress (2): 270/358 kB | 414/640 kB
  2289. Progress (2): 274/358 kB | 414/640 kB
  2290. Progress (2): 279/358 kB | 414/640 kB
  2291. Progress (2): 283/358 kB | 414/640 kB
  2292. Progress (2): 283/358 kB | 418/640 kB
  2293. Progress (2): 283/358 kB | 422/640 kB
  2294. Progress (2): 283/358 kB | 426/640 kB
  2295. Progress (2): 283/358 kB | 430/640 kB
  2296. Progress (2): 283/358 kB | 434/640 kB
  2297. Progress (2): 283/358 kB | 438/640 kB
  2298. Progress (2): 283/358 kB | 442/640 kB
  2299. Progress (2): 283/358 kB | 446/640 kB
  2300. Progress (2): 283/358 kB | 450/640 kB
  2301. Progress (2): 283/358 kB | 454/640 kB
  2302. Progress (2): 283/358 kB | 458/640 kB
  2303. Progress (2): 283/358 kB | 463/640 kB
  2304. Progress (2): 283/358 kB | 467/640 kB
  2305. Progress (2): 283/358 kB | 471/640 kB
  2306. Progress (2): 287/358 kB | 471/640 kB
  2307. Progress (2): 291/358 kB | 471/640 kB
  2308. Progress (2): 295/358 kB | 471/640 kB
  2309. Progress (2): 299/358 kB | 471/640 kB
  2310. Progress (2): 303/358 kB | 471/640 kB
  2311. Progress (2): 303/358 kB | 475/640 kB
  2312. Progress (2): 307/358 kB | 475/640 kB
  2313. Progress (2): 307/358 kB | 479/640 kB
  2314. Progress (2): 311/358 kB | 479/640 kB
  2315. Progress (2): 311/358 kB | 483/640 kB
  2316. Progress (2): 315/358 kB | 483/640 kB
  2317. Progress (2): 315/358 kB | 487/640 kB
  2318. Progress (2): 315/358 kB | 491/640 kB
  2319. Progress (2): 315/358 kB | 495/640 kB
  2320. Progress (2): 315/358 kB | 499/640 kB
  2321. Progress (2): 315/358 kB | 504/640 kB
  2322. Progress (2): 315/358 kB | 508/640 kB
  2323. Progress (2): 315/358 kB | 512/640 kB
  2324. Progress (2): 315/358 kB | 516/640 kB
  2325. Progress (2): 315/358 kB | 520/640 kB
  2326. Progress (2): 315/358 kB | 524/640 kB
  2327. Progress (2): 315/358 kB | 528/640 kB
  2328. Progress (2): 315/358 kB | 532/640 kB
  2329. Progress (2): 315/358 kB | 536/640 kB
  2330. Progress (2): 319/358 kB | 536/640 kB
  2331. Progress (2): 324/358 kB | 536/640 kB
  2332. Progress (2): 328/358 kB | 536/640 kB
  2333. Progress (2): 332/358 kB | 536/640 kB
  2334. Progress (2): 332/358 kB | 540/640 kB
  2335. Progress (2): 332/358 kB | 544/640 kB
  2336. Progress (2): 336/358 kB | 544/640 kB
  2337. Progress (2): 336/358 kB | 549/640 kB
  2338. Progress (2): 340/358 kB | 549/640 kB
  2339. Progress (2): 340/358 kB | 553/640 kB
  2340. Progress (2): 344/358 kB | 553/640 kB
  2341. Progress (2): 348/358 kB | 553/640 kB
  2342. Progress (2): 348/358 kB | 557/640 kB
  2343. Progress (2): 348/358 kB | 561/640 kB
  2344. Progress (2): 348/358 kB | 565/640 kB
  2345. Progress (2): 348/358 kB | 569/640 kB
  2346. Progress (2): 348/358 kB | 573/640 kB
  2347. Progress (2): 348/358 kB | 577/640 kB
  2348. Progress (2): 348/358 kB | 581/640 kB
  2349. Progress (2): 348/358 kB | 585/640 kB
  2350. Progress (2): 348/358 kB | 590/640 kB
  2351. Progress (2): 348/358 kB | 594/640 kB
  2352. Progress (2): 348/358 kB | 598/640 kB
  2353. Progress (2): 348/358 kB | 602/640 kB
  2354. Progress (2): 352/358 kB | 602/640 kB
  2355. Progress (2): 356/358 kB | 602/640 kB
  2356. Progress (2): 358 kB | 602/640 kB
  2357. Progress (2): 358 kB | 606/640 kB
  2358. Progress (2): 358 kB | 610/640 kB
  2359. Progress (2): 358 kB | 614/640 kB
  2360. Progress (2): 358 kB | 618/640 kB
  2361. Progress (2): 358 kB | 622/640 kB
  2362. Progress (2): 358 kB | 626/640 kB
  2363. Progress (2): 358 kB | 630/640 kB
  2364. Progress (2): 358 kB | 635/640 kB
  2365. Progress (2): 358 kB | 639/640 kB
  2366. Progress (2): 358 kB | 640 kB
  2367.  
  2368. Downloaded from central: https://repo.maven.apache.org/maven2/log4j/log4j/1.2.12/log4j-1.2.12.jar (358 kB at 35 kB/s)
  2369. Downloaded from central: https://repo.maven.apache.org/maven2/com/google/collections/google-collections/1.0/google-collections-1.0.jar (640 kB at 63 kB/s)
  2370. [INFO] No sources to compile
  2371. [INFO]
  2372. [INFO] --- maven-resources-plugin:2.6:testResources (default-testResources) @ simple-maven-project-with-tests ---
  2373. [INFO] Using 'UTF-8' encoding to copy filtered resources.
  2374. [INFO] skip non existing resourceDirectory /root/.jenkins/workspace/jenkins_pipeline_demo/src/test/resources
  2375. [INFO]
  2376. [INFO] --- maven-compiler-plugin:3.1:testCompile (default-testCompile) @ simple-maven-project-with-tests ---
  2377. [INFO] Changes detected - recompiling the module!
  2378. [INFO] Compiling 3 source files to /root/.jenkins/workspace/jenkins_pipeline_demo/target/test-classes
  2379. [INFO]
  2380. [INFO] --- maven-surefire-plugin:2.18.1:test (default-test) @ simple-maven-project-with-tests ---
  2381. Downloading from central: https://repo.maven.apache.org/maven2/org/apache/maven/surefire/maven-surefire-common/2.18.1/maven-surefire-common-2.18.1.pom
  2382. Progress (1): 4.1/6.3 kB
  2383. Progress (1): 6.3 kB
  2384.  
  2385. Downloaded from central: https://repo.maven.apache.org/maven2/org/apache/maven/surefire/maven-surefire-common/2.18.1/maven-surefire-common-2.18.1.pom (6.3 kB at 8.5 kB/s)
  2386. Downloading from central: https://repo.maven.apache.org/maven2/org/apache/maven/plugin-tools/maven-plugin-annotations/3.3/maven-plugin-annotations-3.3.pom
  2387. Progress (1): 1.6 kB
  2388.  
  2389. Downloaded from central: https://repo.maven.apache.org/maven2/org/apache/maven/plugin-tools/maven-plugin-annotations/3.3/maven-plugin-annotations-3.3.pom (1.6 kB at 2.3 kB/s)
  2390. Downloading from central: https://repo.maven.apache.org/maven2/org/apache/maven/plugin-tools/maven-plugin-tools/3.3/maven-plugin-tools-3.3.pom
  2391. Progress (1): 4.1/13 kB
  2392. Progress (1): 8.2/13 kB
  2393. Progress (1): 12/13 kB
  2394. Progress (1): 13 kB
  2395.  
  2396. Downloaded from central: https://repo.maven.apache.org/maven2/org/apache/maven/plugin-tools/maven-plugin-tools/3.3/maven-plugin-tools-3.3.pom (13 kB at 22 kB/s)
  2397. Downloading from central: https://repo.maven.apache.org/maven2/org/apache/maven/maven-parent/24/maven-parent-24.pom
  2398. Progress (1): 4.1/37 kB
  2399. Progress (1): 8.2/37 kB
  2400. Progress (1): 12/37 kB
  2401. Progress (1): 16/37 kB
  2402. Progress (1): 20/37 kB
  2403. Progress (1): 25/37 kB
  2404. Progress (1): 29/37 kB
  2405. Progress (1): 33/37 kB
  2406. Progress (1): 37/37 kB
  2407. Progress (1): 37 kB
  2408.  
  2409. Downloaded from central: https://repo.maven.apache.org/maven2/org/apache/maven/maven-parent/24/maven-parent-24.pom (37 kB at 64 kB/s)
  2410. Downloading from central: https://repo.maven.apache.org/maven2/org/apache/apache/14/apache-14.pom
  2411. Progress (1): 4.1/15 kB
  2412. Progress (1): 8.2/15 kB
  2413. Progress (1): 12/15 kB
  2414. Progress (1): 15 kB
  2415.  
  2416. Downloaded from central: https://repo.maven.apache.org/maven2/org/apache/apache/14/apache-14.pom (15 kB at 23 kB/s)
  2417. Downloading from central: https://repo.maven.apache.org/maven2/org/apache/maven/surefire/surefire-api/2.18.1/surefire-api-2.18.1.pom
  2418. Progress (1): 2.3 kB
  2419.  
  2420. Downloaded from central: https://repo.maven.apache.org/maven2/org/apache/maven/surefire/surefire-api/2.18.1/surefire-api-2.18.1.pom (2.3 kB at 3.8 kB/s)
  2421. Downloading from central: https://repo.maven.apache.org/maven2/org/apache/maven/surefire/surefire-booter/2.18.1/surefire-booter-2.18.1.pom
  2422. Progress (1): 2.9 kB
  2423.  
  2424. Downloaded from central: https://repo.maven.apache.org/maven2/org/apache/maven/surefire/surefire-booter/2.18.1/surefire-booter-2.18.1.pom (2.9 kB at 4.8 kB/s)
  2425. Downloading from central: https://repo.maven.apache.org/maven2/org/apache/maven/reporting/maven-reporting-api/3.0/maven-reporting-api-3.0.pom
  2426. Progress (1): 2.4 kB
  2427.  
  2428. Downloaded from central: https://repo.maven.apache.org/maven2/org/apache/maven/reporting/maven-reporting-api/3.0/maven-reporting-api-3.0.pom (2.4 kB at 4.5 kB/s)
  2429. Downloading from central: https://repo.maven.apache.org/maven2/org/apache/maven/shared/maven-shared-components/15/maven-shared-components-15.pom
  2430. Progress (1): 4.1/9.3 kB
  2431. Progress (1): 8.2/9.3 kB
  2432. Progress (1): 9.3 kB
  2433.  
  2434. Downloaded from central: https://repo.maven.apache.org/maven2/org/apache/maven/shared/maven-shared-components/15/maven-shared-components-15.pom (9.3 kB at 18 kB/s)
  2435. Downloading from central: https://repo.maven.apache.org/maven2/org/apache/maven/maven-parent/16/maven-parent-16.pom
  2436. Progress (1): 4.1/23 kB
  2437. Progress (1): 8.2/23 kB
  2438. Progress (1): 12/23 kB
  2439. Progress (1): 16/23 kB
  2440. Progress (1): 20/23 kB
  2441. Progress (1): 23 kB
  2442.  
  2443. Downloaded from central: https://repo.maven.apache.org/maven2/org/apache/maven/maven-parent/16/maven-parent-16.pom (23 kB at 32 kB/s)
  2444. Downloading from central: https://repo.maven.apache.org/maven2/org/apache/apache/7/apache-7.pom
  2445. Progress (1): 4.1/14 kB
  2446. Progress (1): 8.2/14 kB
  2447. Progress (1): 12/14 kB
  2448. Progress (1): 14 kB
  2449.  
  2450. Downloaded from central: https://repo.maven.apache.org/maven2/org/apache/apache/7/apache-7.pom (14 kB at 21 kB/s)
  2451. Downloading from central: https://repo.maven.apache.org/maven2/org/apache/maven/maven-toolchain/2.2.1/maven-toolchain-2.2.1.pom
  2452. Progress (1): 3.3 kB
  2453.  
  2454. Downloaded from central: https://repo.maven.apache.org/maven2/org/apache/maven/maven-toolchain/2.2.1/maven-toolchain-2.2.1.pom (3.3 kB at 6.0 kB/s)
  2455. Downloading from central: https://repo.maven.apache.org/maven2/org/apache/commons/commons-lang3/3.1/commons-lang3-3.1.pom
  2456. Progress (1): 4.1/17 kB
  2457. Progress (1): 8.2/17 kB
  2458. Progress (1): 12/17 kB
  2459. Progress (1): 16/17 kB
  2460. Progress (1): 17 kB
  2461.  
  2462. Downloaded from central: https://repo.maven.apache.org/maven2/org/apache/commons/commons-lang3/3.1/commons-lang3-3.1.pom (17 kB at 24 kB/s)
  2463. Downloading from central: https://repo.maven.apache.org/maven2/org/apache/commons/commons-parent/22/commons-parent-22.pom
  2464. Progress (1): 4.1/42 kB
  2465. Progress (1): 8.2/42 kB
  2466. Progress (1): 12/42 kB
  2467. Progress (1): 16/42 kB
  2468. Progress (1): 20/42 kB
  2469. Progress (1): 25/42 kB
  2470. Progress (1): 29/42 kB
  2471. Progress (1): 33/42 kB
  2472. Progress (1): 37/42 kB
  2473. Progress (1): 41/42 kB
  2474. Progress (1): 42 kB
  2475.  
  2476. Downloaded from central: https://repo.maven.apache.org/maven2/org/apache/commons/commons-parent/22/commons-parent-22.pom (42 kB at 56 kB/s)
  2477. Downloading from central: https://repo.maven.apache.org/maven2/org/apache/apache/9/apache-9.pom
  2478. Progress (1): 4.1/15 kB
  2479. Progress (1): 8.2/15 kB
  2480. Progress (1): 12/15 kB
  2481. Progress (1): 15 kB
  2482.  
  2483. Downloaded from central: https://repo.maven.apache.org/maven2/org/apache/apache/9/apache-9.pom (15 kB at 23 kB/s)
  2484. Downloading from central: https://repo.maven.apache.org/maven2/org/apache/maven/maven-plugin-api/2.2.1/maven-plugin-api-2.2.1.jar
  2485. Downloading from central: https://repo.maven.apache.org/maven2/org/apache/maven/surefire/surefire-booter/2.18.1/surefire-booter-2.18.1.jar
  2486. Downloading from central: https://repo.maven.apache.org/maven2/org/apache/maven/maven-artifact/2.2.1/maven-artifact-2.2.1.jar
  2487. Downloading from central: https://repo.maven.apache.org/maven2/org/apache/maven/surefire/maven-surefire-common/2.18.1/maven-surefire-common-2.18.1.jar
  2488. Downloading from central: https://repo.maven.apache.org/maven2/org/codehaus/plexus/plexus-utils/1.5.15/plexus-utils-1.5.15.jar
  2489. Progress (1): 4.1/12 kB
  2490. Progress (1): 8.2/12 kB
  2491. Progress (1): 12/12 kB
  2492. Progress (1): 12 kB
  2493. Progress (2): 12 kB | 4.1/40 kB
  2494. Progress (2): 12 kB | 8.2/40 kB
  2495. Progress (2): 12 kB | 12/40 kB
  2496. Progress (2): 12 kB | 16/40 kB
  2497. Progress (2): 12 kB | 20/40 kB
  2498. Progress (2): 12 kB | 25/40 kB
  2499. Progress (2): 12 kB | 29/40 kB
  2500. Progress (2): 12 kB | 33/40 kB
  2501. Progress (3): 12 kB | 33/40 kB | 4.1/228 kB
  2502. Progress (3): 12 kB | 33/40 kB | 8.2/228 kB
  2503. Progress (3): 12 kB | 33/40 kB | 12/228 kB
  2504. Progress (3): 12 kB | 33/40 kB | 16/228 kB
  2505. Progress (3): 12 kB | 33/40 kB | 20/228 kB
  2506. Progress (3): 12 kB | 33/40 kB | 25/228 kB
  2507. Progress (3): 12 kB | 33/40 kB | 29/228 kB
  2508. Progress (3): 12 kB | 33/40 kB | 33/228 kB
  2509. Progress (4): 12 kB | 33/40 kB | 33/228 kB | 4.1/80 kB
  2510. Progress (4): 12 kB | 33/40 kB | 33/228 kB | 8.2/80 kB
  2511. Progress (4): 12 kB | 33/40 kB | 37/228 kB | 8.2/80 kB
  2512. Progress (4): 12 kB | 33/40 kB | 37/228 kB | 12/80 kB
  2513. Progress (4): 12 kB | 33/40 kB | 41/228 kB | 12/80 kB
  2514. Progress (4): 12 kB | 33/40 kB | 41/228 kB | 16/80 kB
  2515. Progress (4): 12 kB | 33/40 kB | 45/228 kB | 16/80 kB
  2516. Progress (4): 12 kB | 33/40 kB | 49/228 kB | 16/80 kB
  2517. Progress (4): 12 kB | 33/40 kB | 53/228 kB | 16/80 kB
  2518. Progress (4): 12 kB | 33/40 kB | 57/228 kB | 16/80 kB
  2519. Progress (4): 12 kB | 33/40 kB | 61/228 kB | 16/80 kB
  2520. Progress (4): 12 kB | 33/40 kB | 66/228 kB | 16/80 kB
  2521. Progress (4): 12 kB | 33/40 kB | 66/228 kB | 20/80 kB
  2522. Progress (4): 12 kB | 33/40 kB | 66/228 kB | 25/80 kB
  2523. Progress (4): 12 kB | 33/40 kB | 66/228 kB | 29/80 kB
  2524. Progress (4): 12 kB | 33/40 kB | 66/228 kB | 33/80 kB
  2525. Progress (4): 12 kB | 37/40 kB | 66/228 kB | 33/80 kB
  2526. Progress (4): 12 kB | 40 kB | 66/228 kB | 33/80 kB
  2527. Progress (4): 12 kB | 40 kB | 70/228 kB | 33/80 kB
  2528. Progress (4): 12 kB | 40 kB | 74/228 kB | 33/80 kB
  2529. Progress (4): 12 kB | 40 kB | 78/228 kB | 33/80 kB
  2530. Progress (4): 12 kB | 40 kB | 82/228 kB | 33/80 kB
  2531.  
  2532. Downloaded from central: https://repo.maven.apache.org/maven2/org/apache/maven/maven-plugin-api/2.2.1/maven-plugin-api-2.2.1.jar (12 kB at 18 kB/s)
  2533. Downloading from central: https://repo.maven.apache.org/maven2/org/apache/maven/maven-plugin-descriptor/2.2.1/maven-plugin-descriptor-2.2.1.jar
  2534. Progress (3): 40 kB | 86/228 kB | 33/80 kB
  2535. Progress (3): 40 kB | 86/228 kB | 37/80 kB
  2536. Progress (3): 40 kB | 90/228 kB | 37/80 kB
  2537. Progress (3): 40 kB | 94/228 kB | 37/80 kB
  2538. Progress (3): 40 kB | 98/228 kB | 37/80 kB
  2539. Progress (3): 40 kB | 98/228 kB | 41/80 kB
  2540. Progress (3): 40 kB | 98/228 kB | 45/80 kB
  2541. Progress (3): 40 kB | 98/228 kB | 49/80 kB
  2542. Progress (3): 40 kB | 102/228 kB | 49/80 kB
  2543. Progress (3): 40 kB | 106/228 kB | 49/80 kB
  2544. Progress (4): 40 kB | 106/228 kB | 49/80 kB | 4.1/274 kB
  2545. Progress (4): 40 kB | 111/228 kB | 49/80 kB | 4.1/274 kB
  2546. Progress (4): 40 kB | 111/228 kB | 53/80 kB | 4.1/274 kB
  2547. Progress (4): 40 kB | 115/228 kB | 53/80 kB | 4.1/274 kB
  2548. Progress (4): 40 kB | 115/228 kB | 53/80 kB | 8.2/274 kB
  2549. Progress (4): 40 kB | 115/228 kB | 53/80 kB | 12/274 kB
  2550. Progress (4): 40 kB | 115/228 kB | 53/80 kB | 16/274 kB
  2551. Progress (4): 40 kB | 115/228 kB | 57/80 kB | 16/274 kB
  2552. Progress (4): 40 kB | 119/228 kB | 57/80 kB | 16/274 kB
  2553. Progress (4): 40 kB | 123/228 kB | 57/80 kB | 16/274 kB
  2554. Progress (4): 40 kB | 123/228 kB | 61/80 kB | 16/274 kB
  2555. Progress (4): 40 kB | 127/228 kB | 61/80 kB | 16/274 kB
  2556. Progress (4): 40 kB | 127/228 kB | 66/80 kB | 16/274 kB
  2557. Progress (4): 40 kB | 131/228 kB | 66/80 kB | 16/274 kB
  2558. Progress (4): 40 kB | 135/228 kB | 66/80 kB | 16/274 kB
  2559. Progress (4): 40 kB | 139/228 kB | 66/80 kB | 16/274 kB
  2560. Progress (4): 40 kB | 143/228 kB | 66/80 kB | 16/274 kB
  2561. Progress (4): 40 kB | 147/228 kB | 66/80 kB | 16/274 kB
  2562. Progress (4): 40 kB | 147/228 kB | 70/80 kB | 16/274 kB
  2563. Progress (4): 40 kB | 152/228 kB | 70/80 kB | 16/274 kB
  2564.  
  2565. Downloaded from central: https://repo.maven.apache.org/maven2/org/apache/maven/surefire/surefire-booter/2.18.1/surefire-booter-2.18.1.jar (40 kB at 37 kB/s)
  2566. Downloading from central: https://repo.maven.apache.org/maven2/org/apache/maven/maven-project/2.2.1/maven-project-2.2.1.jar
  2567. Progress (3): 152/228 kB | 74/80 kB | 16/274 kB
  2568. Progress (3): 156/228 kB | 74/80 kB | 16/274 kB
  2569. Progress (3): 156/228 kB | 74/80 kB | 20/274 kB
  2570. Progress (3): 156/228 kB | 78/80 kB | 20/274 kB
  2571. Progress (3): 156/228 kB | 78/80 kB | 25/274 kB
  2572. Progress (3): 160/228 kB | 78/80 kB | 25/274 kB
  2573. Progress (3): 164/228 kB | 78/80 kB | 25/274 kB
  2574. Progress (3): 164/228 kB | 78/80 kB | 29/274 kB
  2575. Progress (3): 164/228 kB | 80 kB | 29/274 kB
  2576. Progress (3): 168/228 kB | 80 kB | 29/274 kB
  2577. Progress (3): 168/228 kB | 80 kB | 33/274 kB
  2578. Progress (3): 172/228 kB | 80 kB | 33/274 kB
  2579. Progress (3): 176/228 kB | 80 kB | 33/274 kB
  2580. Progress (3): 180/228 kB | 80 kB | 33/274 kB
  2581. Progress (3): 184/228 kB | 80 kB | 33/274 kB
  2582. Progress (3): 188/228 kB | 80 kB | 33/274 kB
  2583. Progress (3): 193/228 kB | 80 kB | 33/274 kB
  2584. Progress (3): 197/228 kB | 80 kB | 33/274 kB
  2585. Progress (3): 201/228 kB | 80 kB | 33/274 kB
  2586. Progress (3): 205/228 kB | 80 kB | 33/274 kB
  2587. Progress (4): 205/228 kB | 80 kB | 33/274 kB | 4.1/39 kB
  2588. Progress (4): 209/228 kB | 80 kB | 33/274 kB | 4.1/39 kB
  2589. Progress (4): 209/228 kB | 80 kB | 33/274 kB | 8.2/39 kB
  2590. Progress (4): 213/228 kB | 80 kB | 33/274 kB | 8.2/39 kB
  2591. Progress (4): 213/228 kB | 80 kB | 33/274 kB | 12/39 kB
  2592. Progress (4): 213/228 kB | 80 kB | 33/274 kB | 16/39 kB
  2593. Progress (4): 213/228 kB | 80 kB | 33/274 kB | 20/39 kB
  2594. Progress (4): 213/228 kB | 80 kB | 33/274 kB | 25/39 kB
  2595. Progress (4): 213/228 kB | 80 kB | 33/274 kB | 29/39 kB
  2596. Progress (4): 213/228 kB | 80 kB | 33/274 kB | 33/39 kB
  2597. Progress (4): 213/228 kB | 80 kB | 33/274 kB | 37/39 kB
  2598. Progress (4): 213/228 kB | 80 kB | 33/274 kB | 39 kB
  2599. Progress (4): 217/228 kB | 80 kB | 33/274 kB | 39 kB
  2600. Progress (4): 221/228 kB | 80 kB | 33/274 kB | 39 kB
  2601. Progress (4): 225/228 kB | 80 kB | 33/274 kB | 39 kB
  2602. Progress (4): 228 kB | 80 kB | 33/274 kB | 39 kB
  2603.  
  2604. Downloaded from central: https://repo.maven.apache.org/maven2/org/apache/maven/maven-artifact/2.2.1/maven-artifact-2.2.1.jar (80 kB at 54 kB/s)
  2605. Downloading from central: https://repo.maven.apache.org/maven2/org/apache/maven/maven-settings/2.2.1/maven-settings-2.2.1.jar
  2606. Progress (4): 228 kB | 33/274 kB | 39 kB | 4.1/156 kB
  2607.  
  2608. Downloaded from central: https://repo.maven.apache.org/maven2/org/apache/maven/maven-plugin-descriptor/2.2.1/maven-plugin-descriptor-2.2.1.jar (39 kB at 26 kB/s)
  2609. Progress (3): 228 kB | 33/274 kB | 8.2/156 kB
  2610.  
  2611. Downloading from central: https://repo.maven.apache.org/maven2/org/apache/maven/maven-profile/2.2.1/maven-profile-2.2.1.jar
  2612. Progress (3): 228 kB | 33/274 kB | 12/156 kB
  2613. Progress (3): 228 kB | 33/274 kB | 16/156 kB
  2614. Progress (3): 228 kB | 33/274 kB | 20/156 kB
  2615. Progress (3): 228 kB | 33/274 kB | 25/156 kB
  2616. Progress (3): 228 kB | 33/274 kB | 29/156 kB
  2617. Progress (3): 228 kB | 33/274 kB | 33/156 kB
  2618. Progress (3): 228 kB | 33/274 kB | 37/156 kB
  2619. Progress (3): 228 kB | 33/274 kB | 41/156 kB
  2620. Progress (3): 228 kB | 33/274 kB | 45/156 kB
  2621. Progress (3): 228 kB | 33/274 kB | 49/156 kB
  2622. Progress (3): 228 kB | 37/274 kB | 49/156 kB
  2623. Progress (3): 228 kB | 41/274 kB | 49/156 kB
  2624. Progress (3): 228 kB | 45/274 kB | 49/156 kB
  2625. Progress (3): 228 kB | 49/274 kB | 49/156 kB
  2626. Progress (3): 228 kB | 49/274 kB | 53/156 kB
  2627. Progress (3): 228 kB | 49/274 kB | 57/156 kB
  2628. Progress (3): 228 kB | 49/274 kB | 61/156 kB
  2629.  
  2630. Downloaded from central: https://repo.maven.apache.org/maven2/org/codehaus/plexus/plexus-utils/1.5.15/plexus-utils-1.5.15.jar (228 kB at 118 kB/s)
  2631. Downloading from central: https://repo.maven.apache.org/maven2/org/apache/maven/maven-artifact-manager/2.2.1/maven-artifact-manager-2.2.1.jar
  2632. Progress (2): 49/274 kB | 66/156 kB
  2633. Progress (3): 49/274 kB | 66/156 kB | 4.1/49 kB
  2634. Progress (3): 49/274 kB | 66/156 kB | 8.2/49 kB
  2635. Progress (3): 49/274 kB | 66/156 kB | 12/49 kB
  2636. Progress (3): 49/274 kB | 66/156 kB | 16/49 kB
  2637. Progress (3): 49/274 kB | 66/156 kB | 20/49 kB
  2638. Progress (3): 49/274 kB | 66/156 kB | 25/49 kB
  2639. Progress (3): 49/274 kB | 66/156 kB | 29/49 kB
  2640. Progress (3): 49/274 kB | 66/156 kB | 33/49 kB
  2641. Progress (3): 49/274 kB | 66/156 kB | 37/49 kB
  2642. Progress (3): 49/274 kB | 66/156 kB | 41/49 kB
  2643. Progress (3): 49/274 kB | 66/156 kB | 45/49 kB
  2644. Progress (3): 49/274 kB | 66/156 kB | 49 kB
  2645. Progress (4): 49/274 kB | 66/156 kB | 49 kB | 4.1/35 kB
  2646. Progress (4): 49/274 kB | 66/156 kB | 49 kB | 8.2/35 kB
  2647. Progress (4): 49/274 kB | 66/156 kB | 49 kB | 12/35 kB
  2648. Progress (4): 49/274 kB | 66/156 kB | 49 kB | 16/35 kB
  2649. Progress (4): 49/274 kB | 66/156 kB | 49 kB | 20/35 kB
  2650. Progress (4): 49/274 kB | 66/156 kB | 49 kB | 25/35 kB
  2651. Progress (4): 49/274 kB | 66/156 kB | 49 kB | 29/35 kB
  2652. Progress (4): 49/274 kB | 66/156 kB | 49 kB | 33/35 kB
  2653. Progress (4): 49/274 kB | 66/156 kB | 49 kB | 35 kB
  2654. Progress (4): 49/274 kB | 70/156 kB | 49 kB | 35 kB
  2655. Progress (4): 49/274 kB | 74/156 kB | 49 kB | 35 kB
  2656. Progress (4): 49/274 kB | 78/156 kB | 49 kB | 35 kB
  2657. Progress (4): 49/274 kB | 82/156 kB | 49 kB | 35 kB
  2658. Progress (4): 53/274 kB | 82/156 kB | 49 kB | 35 kB
  2659. Progress (4): 57/274 kB | 82/156 kB | 49 kB | 35 kB
  2660. Progress (4): 61/274 kB | 82/156 kB | 49 kB | 35 kB
  2661. Progress (4): 66/274 kB | 82/156 kB | 49 kB | 35 kB
  2662. Progress (5): 66/274 kB | 82/156 kB | 49 kB | 35 kB | 4.1/68 kB
  2663. Progress (5): 66/274 kB | 82/156 kB | 49 kB | 35 kB | 8.2/68 kB
  2664. Progress (5): 66/274 kB | 82/156 kB | 49 kB | 35 kB | 12/68 kB
  2665. Progress (5): 66/274 kB | 82/156 kB | 49 kB | 35 kB | 16/68 kB
  2666. Progress (5): 66/274 kB | 82/156 kB | 49 kB | 35 kB | 20/68 kB
  2667. Progress (5): 66/274 kB | 82/156 kB | 49 kB | 35 kB | 25/68 kB
  2668. Progress (5): 66/274 kB | 82/156 kB | 49 kB | 35 kB | 29/68 kB
  2669. Progress (5): 66/274 kB | 82/156 kB | 49 kB | 35 kB | 33/68 kB
  2670.  
  2671. Downloaded from central: https://repo.maven.apache.org/maven2/org/apache/maven/maven-settings/2.2.1/maven-settings-2.2.1.jar (49 kB at 20 kB/s)
  2672. Progress (4): 66/274 kB | 82/156 kB | 35 kB | 37/68 kB
  2673.  
  2674. Downloaded from central: https://repo.maven.apache.org/maven2/org/apache/maven/maven-profile/2.2.1/maven-profile-2.2.1.jar (35 kB at 15 kB/s)
  2675. Downloading from central: https://repo.maven.apache.org/maven2/org/apache/maven/maven-plugin-registry/2.2.1/maven-plugin-registry-2.2.1.jar
  2676. Progress (3): 66/274 kB | 82/156 kB | 41/68 kB
  2677.  
  2678. Downloading from central: https://repo.maven.apache.org/maven2/backport-util-concurrent/backport-util-concurrent/3.1/backport-util-concurrent-3.1.jar
  2679. Progress (3): 66/274 kB | 82/156 kB | 45/68 kB
  2680. Progress (3): 66/274 kB | 82/156 kB | 49/68 kB
  2681. Progress (3): 66/274 kB | 82/156 kB | 53/68 kB
  2682. Progress (3): 66/274 kB | 82/156 kB | 57/68 kB
  2683. Progress (3): 66/274 kB | 82/156 kB | 61/68 kB
  2684. Progress (3): 66/274 kB | 82/156 kB | 66/68 kB
  2685. Progress (3): 66/274 kB | 82/156 kB | 68 kB
  2686. Progress (3): 66/274 kB | 86/156 kB | 68 kB
  2687. Progress (3): 66/274 kB | 90/156 kB | 68 kB
  2688. Progress (3): 66/274 kB | 94/156 kB | 68 kB
  2689. Progress (3): 66/274 kB | 98/156 kB | 68 kB
  2690. Progress (4): 66/274 kB | 98/156 kB | 68 kB | 4.1/30 kB
  2691. Progress (4): 66/274 kB | 98/156 kB | 68 kB | 8.2/30 kB
  2692. Progress (4): 66/274 kB | 98/156 kB | 68 kB | 12/30 kB
  2693. Progress (4): 66/274 kB | 98/156 kB | 68 kB | 16/30 kB
  2694. Progress (4): 66/274 kB | 102/156 kB | 68 kB | 16/30 kB
  2695. Progress (4): 66/274 kB | 106/156 kB | 68 kB | 16/30 kB
  2696. Progress (4): 66/274 kB | 106/156 kB | 68 kB | 20/30 kB
  2697.  
  2698. Downloaded from central: https://repo.maven.apache.org/maven2/org/apache/maven/maven-artifact-manager/2.2.1/maven-artifact-manager-2.2.1.jar (68 kB at 23 kB/s)
  2699. Progress (3): 66/274 kB | 111/156 kB | 20/30 kB
  2700.  
  2701. Downloading from central: https://repo.maven.apache.org/maven2/org/codehaus/plexus/plexus-interpolation/1.11/plexus-interpolation-1.11.jar
  2702. Progress (4): 66/274 kB | 111/156 kB | 20/30 kB | 4.1/332 kB
  2703. Progress (4): 66/274 kB | 111/156 kB | 25/30 kB | 4.1/332 kB
  2704. Progress (4): 66/274 kB | 111/156 kB | 25/30 kB | 8.2/332 kB
  2705. Progress (4): 66/274 kB | 115/156 kB | 25/30 kB | 8.2/332 kB
  2706. Progress (4): 66/274 kB | 115/156 kB | 25/30 kB | 12/332 kB
  2707. Progress (4): 66/274 kB | 115/156 kB | 29/30 kB | 12/332 kB
  2708. Progress (4): 66/274 kB | 115/156 kB | 29/30 kB | 16/332 kB
  2709. Progress (4): 66/274 kB | 115/156 kB | 29/30 kB | 20/332 kB
  2710. Progress (4): 66/274 kB | 115/156 kB | 29/30 kB | 25/332 kB
  2711. Progress (4): 66/274 kB | 115/156 kB | 29/30 kB | 29/332 kB
  2712. Progress (4): 66/274 kB | 115/156 kB | 29/30 kB | 33/332 kB
  2713. Progress (4): 66/274 kB | 115/156 kB | 29/30 kB | 37/332 kB
  2714. Progress (4): 66/274 kB | 115/156 kB | 29/30 kB | 41/332 kB
  2715. Progress (4): 66/274 kB | 115/156 kB | 30 kB | 41/332 kB
  2716. Progress (4): 66/274 kB | 115/156 kB | 30 kB | 45/332 kB
  2717. Progress (4): 66/274 kB | 115/156 kB | 30 kB | 49/332 kB
  2718. Progress (4): 66/274 kB | 115/156 kB | 30 kB | 53/332 kB
  2719. Progress (4): 66/274 kB | 115/156 kB | 30 kB | 57/332 kB
  2720. Progress (4): 66/274 kB | 115/156 kB | 30 kB | 61/332 kB
  2721. Progress (4): 66/274 kB | 115/156 kB | 30 kB | 66/332 kB
  2722. Progress (4): 66/274 kB | 119/156 kB | 30 kB | 66/332 kB
  2723. Progress (4): 66/274 kB | 123/156 kB | 30 kB | 66/332 kB
  2724. Progress (4): 66/274 kB | 127/156 kB | 30 kB | 66/332 kB
  2725. Progress (4): 66/274 kB | 131/156 kB | 30 kB | 66/332 kB
  2726. Progress (4): 70/274 kB | 131/156 kB | 30 kB | 66/332 kB
  2727. Progress (4): 74/274 kB | 131/156 kB | 30 kB | 66/332 kB
  2728. Progress (4): 78/274 kB | 131/156 kB | 30 kB | 66/332 kB
  2729. Progress (4): 78/274 kB | 131/156 kB | 30 kB | 70/332 kB
  2730. Progress (4): 82/274 kB | 131/156 kB | 30 kB | 70/332 kB
  2731. Progress (4): 82/274 kB | 131/156 kB | 30 kB | 74/332 kB
  2732. Progress (4): 82/274 kB | 131/156 kB | 30 kB | 78/332 kB
  2733. Progress (4): 82/274 kB | 131/156 kB | 30 kB | 82/332 kB
  2734. Progress (4): 82/274 kB | 131/156 kB | 30 kB | 86/332 kB
  2735. Progress (4): 82/274 kB | 131/156 kB | 30 kB | 90/332 kB
  2736. Progress (4): 82/274 kB | 131/156 kB | 30 kB | 94/332 kB
  2737. Progress (4): 82/274 kB | 131/156 kB | 30 kB | 98/332 kB
  2738. Progress (4): 82/274 kB | 131/156 kB | 30 kB | 102/332 kB
  2739. Progress (4): 82/274 kB | 131/156 kB | 30 kB | 106/332 kB
  2740. Progress (4): 82/274 kB | 131/156 kB | 30 kB | 111/332 kB
  2741. Progress (4): 82/274 kB | 131/156 kB | 30 kB | 115/332 kB
  2742. Progress (4): 82/274 kB | 131/156 kB | 30 kB | 119/332 kB
  2743. Progress (4): 82/274 kB | 131/156 kB | 30 kB | 123/332 kB
  2744. Progress (4): 82/274 kB | 131/156 kB | 30 kB | 127/332 kB
  2745. Progress (4): 82/274 kB | 131/156 kB | 30 kB | 131/332 kB
  2746. Progress (5): 82/274 kB | 131/156 kB | 30 kB | 131/332 kB | 4.1/51 kB
  2747. Progress (5): 82/274 kB | 131/156 kB | 30 kB | 131/332 kB | 8.2/51 kB
  2748. Progress (5): 82/274 kB | 131/156 kB | 30 kB | 131/332 kB | 12/51 kB
  2749. Progress (5): 82/274 kB | 131/156 kB | 30 kB | 131/332 kB | 16/51 kB
  2750.  
  2751. Downloaded from central: https://repo.maven.apache.org/maven2/org/apache/maven/maven-plugin-registry/2.2.1/maven-plugin-registry-2.2.1.jar (30 kB at 9.1 kB/s)
  2752. Progress (4): 82/274 kB | 131/156 kB | 131/332 kB | 20/51 kB
  2753.  
  2754. Downloading from central: https://repo.maven.apache.org/maven2/org/apache/maven/maven-model/2.2.1/maven-model-2.2.1.jar
  2755. Progress (4): 82/274 kB | 131/156 kB | 131/332 kB | 25/51 kB
  2756. Progress (4): 82/274 kB | 131/156 kB | 131/332 kB | 29/51 kB
  2757. Progress (4): 82/274 kB | 131/156 kB | 131/332 kB | 33/51 kB
  2758. Progress (4): 82/274 kB | 131/156 kB | 131/332 kB | 37/51 kB
  2759. Progress (4): 82/274 kB | 131/156 kB | 131/332 kB | 41/51 kB
  2760. Progress (4): 82/274 kB | 131/156 kB | 131/332 kB | 45/51 kB
  2761. Progress (4): 82/274 kB | 131/156 kB | 131/332 kB | 49/51 kB
  2762. Progress (4): 82/274 kB | 131/156 kB | 131/332 kB | 51 kB
  2763. Progress (4): 82/274 kB | 135/156 kB | 131/332 kB | 51 kB
  2764. Progress (4): 82/274 kB | 139/156 kB | 131/332 kB | 51 kB
  2765. Progress (4): 82/274 kB | 143/156 kB | 131/332 kB | 51 kB
  2766. Progress (4): 82/274 kB | 147/156 kB | 131/332 kB | 51 kB
  2767. Progress (4): 82/274 kB | 152/156 kB | 131/332 kB | 51 kB
  2768. Progress (4): 86/274 kB | 152/156 kB | 131/332 kB | 51 kB
  2769. Progress (4): 86/274 kB | 152/156 kB | 135/332 kB | 51 kB
  2770. Progress (4): 90/274 kB | 152/156 kB | 135/332 kB | 51 kB
  2771. Progress (4): 90/274 kB | 156/156 kB | 135/332 kB | 51 kB
  2772. Progress (4): 94/274 kB | 156/156 kB | 135/332 kB | 51 kB
  2773. Progress (4): 94/274 kB | 156/156 kB | 139/332 kB | 51 kB
  2774. Progress (4): 98/274 kB | 156/156 kB | 139/332 kB | 51 kB
  2775. Progress (4): 98/274 kB | 156 kB | 139/332 kB | 51 kB
  2776. Progress (4): 98/274 kB | 156 kB | 143/332 kB | 51 kB
  2777. Progress (4): 98/274 kB | 156 kB | 147/332 kB | 51 kB
  2778. Progress (4): 98/274 kB | 156 kB | 152/332 kB | 51 kB
  2779. Progress (4): 98/274 kB | 156 kB | 156/332 kB | 51 kB
  2780. Progress (4): 98/274 kB | 156 kB | 160/332 kB | 51 kB
  2781. Progress (4): 98/274 kB | 156 kB | 164/332 kB | 51 kB
  2782. Progress (5): 98/274 kB | 156 kB | 164/332 kB | 51 kB | 4.1/88 kB
  2783. Progress (5): 98/274 kB | 156 kB | 164/332 kB | 51 kB | 8.2/88 kB
  2784. Progress (5): 98/274 kB | 156 kB | 164/332 kB | 51 kB | 12/88 kB
  2785.  
  2786. Downloaded from central: https://repo.maven.apache.org/maven2/org/codehaus/plexus/plexus-interpolation/1.11/plexus-interpolation-1.11.jar (51 kB at 14 kB/s)
  2787. Downloading from central: https://repo.maven.apache.org/maven2/org/apache/maven/maven-core/2.2.1/maven-core-2.2.1.jar
  2788. Progress (4): 98/274 kB | 156 kB | 168/332 kB | 12/88 kB
  2789. Progress (4): 98/274 kB | 156 kB | 172/332 kB | 12/88 kB
  2790. Progress (4): 98/274 kB | 156 kB | 172/332 kB | 16/88 kB
  2791. Progress (4): 98/274 kB | 156 kB | 176/332 kB | 16/88 kB
  2792. Progress (4): 98/274 kB | 156 kB | 180/332 kB | 16/88 kB
  2793. Progress (4): 98/274 kB | 156 kB | 180/332 kB | 20/88 kB
  2794. Progress (4): 98/274 kB | 156 kB | 180/332 kB | 25/88 kB
  2795. Progress (4): 98/274 kB | 156 kB | 184/332 kB | 25/88 kB
  2796. Progress (4): 98/274 kB | 156 kB | 188/332 kB | 25/88 kB
  2797. Progress (4): 98/274 kB | 156 kB | 188/332 kB | 29/88 kB
  2798. Progress (4): 98/274 kB | 156 kB | 188/332 kB | 33/88 kB
  2799. Progress (4): 98/274 kB | 156 kB | 193/332 kB | 33/88 kB
  2800. Progress (4): 98/274 kB | 156 kB | 197/332 kB | 33/88 kB
  2801. Progress (4): 98/274 kB | 156 kB | 201/332 kB | 33/88 kB
  2802. Progress (4): 98/274 kB | 156 kB | 205/332 kB | 33/88 kB
  2803. Progress (4): 98/274 kB | 156 kB | 209/332 kB | 33/88 kB
  2804. Progress (4): 98/274 kB | 156 kB | 213/332 kB | 33/88 kB
  2805. Progress (4): 98/274 kB | 156 kB | 217/332 kB | 33/88 kB
  2806. Progress (4): 98/274 kB | 156 kB | 221/332 kB | 33/88 kB
  2807. Progress (4): 98/274 kB | 156 kB | 225/332 kB | 33/88 kB
  2808. Progress (4): 98/274 kB | 156 kB | 229/332 kB | 33/88 kB
  2809. Progress (4): 98/274 kB | 156 kB | 233/332 kB | 33/88 kB
  2810. Progress (4): 98/274 kB | 156 kB | 238/332 kB | 33/88 kB
  2811. Progress (4): 98/274 kB | 156 kB | 242/332 kB | 33/88 kB
  2812. Progress (4): 98/274 kB | 156 kB | 246/332 kB | 33/88 kB
  2813. Progress (4): 98/274 kB | 156 kB | 250/332 kB | 33/88 kB
  2814. Progress (4): 98/274 kB | 156 kB | 254/332 kB | 33/88 kB
  2815. Progress (4): 102/274 kB | 156 kB | 254/332 kB | 33/88 kB
  2816. Progress (4): 102/274 kB | 156 kB | 258/332 kB | 33/88 kB
  2817. Progress (4): 102/274 kB | 156 kB | 262/332 kB | 33/88 kB
  2818. Progress (4): 102/274 kB | 156 kB | 266/332 kB | 33/88 kB
  2819. Progress (4): 102/274 kB | 156 kB | 266/332 kB | 37/88 kB
  2820. Progress (4): 102/274 kB | 156 kB | 270/332 kB | 37/88 kB
  2821.  
  2822. Downloaded from central: https://repo.maven.apache.org/maven2/org/apache/maven/maven-project/2.2.1/maven-project-2.2.1.jar (156 kB at 37 kB/s)
  2823. Progress (3): 106/274 kB | 270/332 kB | 37/88 kB
  2824.  
  2825. Downloading from central: https://repo.maven.apache.org/maven2/org/apache/maven/maven-plugin-parameter-documenter/2.2.1/maven-plugin-parameter-documenter-2.2.1.jar
  2826. Progress (4): 106/274 kB | 270/332 kB | 37/88 kB | 4.1/178 kB
  2827. Progress (4): 106/274 kB | 270/332 kB | 41/88 kB | 4.1/178 kB
  2828. Progress (4): 106/274 kB | 270/332 kB | 41/88 kB | 8.2/178 kB
  2829. Progress (4): 106/274 kB | 270/332 kB | 41/88 kB | 12/178 kB
  2830. Progress (4): 106/274 kB | 270/332 kB | 41/88 kB | 16/178 kB
  2831. Progress (4): 106/274 kB | 270/332 kB | 41/88 kB | 20/178 kB
  2832. Progress (4): 106/274 kB | 270/332 kB | 41/88 kB | 25/178 kB
  2833. Progress (4): 106/274 kB | 270/332 kB | 41/88 kB | 29/178 kB
  2834. Progress (4): 106/274 kB | 270/332 kB | 41/88 kB | 33/178 kB
  2835. Progress (4): 111/274 kB | 270/332 kB | 41/88 kB | 33/178 kB
  2836. Progress (4): 111/274 kB | 270/332 kB | 45/88 kB | 33/178 kB
  2837. Progress (4): 111/274 kB | 270/332 kB | 45/88 kB | 37/178 kB
  2838. Progress (4): 115/274 kB | 270/332 kB | 45/88 kB | 37/178 kB
  2839. Progress (4): 115/274 kB | 270/332 kB | 45/88 kB | 41/178 kB
  2840. Progress (4): 115/274 kB | 270/332 kB | 49/88 kB | 41/178 kB
  2841. Progress (4): 115/274 kB | 270/332 kB | 49/88 kB | 45/178 kB
  2842. Progress (4): 115/274 kB | 270/332 kB | 49/88 kB | 49/178 kB
  2843. Progress (4): 115/274 kB | 270/332 kB | 53/88 kB | 49/178 kB
  2844. Progress (4): 115/274 kB | 270/332 kB | 57/88 kB | 49/178 kB
  2845. Progress (4): 115/274 kB | 270/332 kB | 57/88 kB | 53/178 kB
  2846. Progress (4): 115/274 kB | 270/332 kB | 61/88 kB | 53/178 kB
  2847. Progress (4): 115/274 kB | 270/332 kB | 61/88 kB | 57/178 kB
  2848. Progress (4): 115/274 kB | 270/332 kB | 66/88 kB | 57/178 kB
  2849. Progress (4): 115/274 kB | 270/332 kB | 66/88 kB | 61/178 kB
  2850. Progress (4): 115/274 kB | 270/332 kB | 66/88 kB | 66/178 kB
  2851. Progress (4): 115/274 kB | 270/332 kB | 70/88 kB | 66/178 kB
  2852. Progress (4): 115/274 kB | 270/332 kB | 74/88 kB | 66/178 kB
  2853. Progress (4): 115/274 kB | 270/332 kB | 78/88 kB | 66/178 kB
  2854. Progress (4): 115/274 kB | 270/332 kB | 82/88 kB | 66/178 kB
  2855. Progress (4): 115/274 kB | 274/332 kB | 82/88 kB | 66/178 kB
  2856. Progress (4): 115/274 kB | 279/332 kB | 82/88 kB | 66/178 kB
  2857. Progress (4): 115/274 kB | 283/332 kB | 82/88 kB | 66/178 kB
  2858. Progress (4): 115/274 kB | 287/332 kB | 82/88 kB | 66/178 kB
  2859. Progress (4): 115/274 kB | 291/332 kB | 82/88 kB | 66/178 kB
  2860. Progress (4): 115/274 kB | 295/332 kB | 82/88 kB | 66/178 kB
  2861. Progress (4): 115/274 kB | 295/332 kB | 86/88 kB | 66/178 kB
  2862. Progress (4): 115/274 kB | 299/332 kB | 86/88 kB | 66/178 kB
  2863. Progress (4): 115/274 kB | 299/332 kB | 88 kB | 66/178 kB
  2864. Progress (4): 115/274 kB | 303/332 kB | 88 kB | 66/178 kB
  2865. Progress (4): 115/274 kB | 307/332 kB | 88 kB | 66/178 kB
  2866. Progress (4): 115/274 kB | 307/332 kB | 88 kB | 70/178 kB
  2867. Progress (4): 115/274 kB | 311/332 kB | 88 kB | 70/178 kB
  2868. Progress (4): 115/274 kB | 311/332 kB | 88 kB | 74/178 kB
  2869. Progress (4): 115/274 kB | 315/332 kB | 88 kB | 74/178 kB
  2870. Progress (4): 115/274 kB | 315/332 kB | 88 kB | 78/178 kB
  2871. Progress (4): 115/274 kB | 319/332 kB | 88 kB | 78/178 kB
  2872. Progress (4): 115/274 kB | 319/332 kB | 88 kB | 82/178 kB
  2873. Progress (4): 115/274 kB | 324/332 kB | 88 kB | 82/178 kB
  2874. Progress (4): 115/274 kB | 328/332 kB | 88 kB | 82/178 kB
  2875. Progress (4): 115/274 kB | 328/332 kB | 88 kB | 86/178 kB
  2876. Progress (4): 115/274 kB | 332 kB | 88 kB | 86/178 kB
  2877. Progress (4): 115/274 kB | 332 kB | 88 kB | 90/178 kB
  2878. Progress (4): 115/274 kB | 332 kB | 88 kB | 94/178 kB
  2879. Progress (4): 115/274 kB | 332 kB | 88 kB | 98/178 kB
  2880. Progress (5): 115/274 kB | 332 kB | 88 kB | 98/178 kB | 4.1/22 kB
  2881. Progress (5): 115/274 kB | 332 kB | 88 kB | 102/178 kB | 4.1/22 kB
  2882. Progress (5): 115/274 kB | 332 kB | 88 kB | 102/178 kB | 8.2/22 kB
  2883. Progress (5): 115/274 kB | 332 kB | 88 kB | 106/178 kB | 8.2/22 kB
  2884. Progress (5): 115/274 kB | 332 kB | 88 kB | 106/178 kB | 12/22 kB
  2885. Progress (5): 115/274 kB | 332 kB | 88 kB | 111/178 kB | 12/22 kB
  2886. Progress (5): 115/274 kB | 332 kB | 88 kB | 111/178 kB | 16/22 kB
  2887. Progress (5): 115/274 kB | 332 kB | 88 kB | 115/178 kB | 16/22 kB
  2888. Progress (5): 115/274 kB | 332 kB | 88 kB | 115/178 kB | 20/22 kB
  2889. Progress (5): 115/274 kB | 332 kB | 88 kB | 115/178 kB | 22 kB
  2890. Progress (5): 115/274 kB | 332 kB | 88 kB | 119/178 kB | 22 kB
  2891. Progress (5): 115/274 kB | 332 kB | 88 kB | 123/178 kB | 22 kB
  2892. Progress (5): 115/274 kB | 332 kB | 88 kB | 127/178 kB | 22 kB
  2893. Progress (5): 115/274 kB | 332 kB | 88 kB | 131/178 kB | 22 kB
  2894. Progress (5): 119/274 kB | 332 kB | 88 kB | 131/178 kB | 22 kB
  2895. Progress (5): 123/274 kB | 332 kB | 88 kB | 131/178 kB | 22 kB
  2896. Progress (5): 127/274 kB | 332 kB | 88 kB | 131/178 kB | 22 kB
  2897. Progress (5): 131/274 kB | 332 kB | 88 kB | 131/178 kB | 22 kB
  2898. Progress (5): 131/274 kB | 332 kB | 88 kB | 135/178 kB | 22 kB
  2899. Progress (5): 131/274 kB | 332 kB | 88 kB | 139/178 kB | 22 kB
  2900. Progress (5): 131/274 kB | 332 kB | 88 kB | 143/178 kB | 22 kB
  2901. Progress (5): 131/274 kB | 332 kB | 88 kB | 147/178 kB | 22 kB
  2902. Progress (5): 131/274 kB | 332 kB | 88 kB | 152/178 kB | 22 kB
  2903. Progress (5): 131/274 kB | 332 kB | 88 kB | 156/178 kB | 22 kB
  2904. Progress (5): 131/274 kB | 332 kB | 88 kB | 160/178 kB | 22 kB
  2905. Progress (5): 131/274 kB | 332 kB | 88 kB | 164/178 kB | 22 kB
  2906. Progress (5): 131/274 kB | 332 kB | 88 kB | 168/178 kB | 22 kB
  2907. Progress (5): 131/274 kB | 332 kB | 88 kB | 172/178 kB | 22 kB
  2908. Progress (5): 131/274 kB | 332 kB | 88 kB | 176/178 kB | 22 kB
  2909. Progress (5): 131/274 kB | 332 kB | 88 kB | 178 kB | 22 kB
  2910.  
  2911. Downloaded from central: https://repo.maven.apache.org/maven2/org/apache/maven/maven-plugin-parameter-documenter/2.2.1/maven-plugin-parameter-documenter-2.2.1.jar (22 kB at 4.6 kB/s)
  2912. Downloading from central: https://repo.maven.apache.org/maven2/org/slf4j/slf4j-jdk14/1.5.6/slf4j-jdk14-1.5.6.jar
  2913. Downloaded from central: https://repo.maven.apache.org/maven2/org/apache/maven/maven-model/2.2.1/maven-model-2.2.1.jar (88 kB at 18 kB/s)
  2914. Downloading from central: https://repo.maven.apache.org/maven2/org/slf4j/slf4j-api/1.5.6/slf4j-api-1.5.6.jar
  2915. Downloaded from central: https://repo.maven.apache.org/maven2/backport-util-concurrent/backport-util-concurrent/3.1/backport-util-concurrent-3.1.jar (332 kB at 68 kB/s)
  2916. Downloading from central: https://repo.maven.apache.org/maven2/org/slf4j/jcl-over-slf4j/1.5.6/jcl-over-slf4j-1.5.6.jar
  2917. Progress (2): 135/274 kB | 178 kB
  2918. Progress (2): 139/274 kB | 178 kB
  2919. Progress (2): 143/274 kB | 178 kB
  2920. Progress (2): 147/274 kB | 178 kB
  2921.  
  2922. Downloaded from central: https://repo.maven.apache.org/maven2/org/apache/maven/maven-core/2.2.1/maven-core-2.2.1.jar (178 kB at 34 kB/s)
  2923. Downloading from central: https://repo.maven.apache.org/maven2/org/apache/maven/reporting/maven-reporting-api/3.0/maven-reporting-api-3.0.jar
  2924. Progress (2): 147/274 kB | 4.1/8.8 kB
  2925. Progress (2): 147/274 kB | 8.2/8.8 kB
  2926. Progress (2): 147/274 kB | 8.8 kB
  2927. Progress (3): 147/274 kB | 8.8 kB | 4.1/22 kB
  2928. Progress (3): 147/274 kB | 8.8 kB | 8.2/22 kB
  2929. Progress (3): 147/274 kB | 8.8 kB | 12/22 kB
  2930. Progress (3): 147/274 kB | 8.8 kB | 16/22 kB
  2931. Progress (3): 147/274 kB | 8.8 kB | 20/22 kB
  2932. Progress (3): 147/274 kB | 8.8 kB | 22 kB
  2933. Progress (4): 147/274 kB | 8.8 kB | 22 kB | 4.1/17 kB
  2934. Progress (4): 147/274 kB | 8.8 kB | 22 kB | 8.2/17 kB
  2935. Progress (4): 147/274 kB | 8.8 kB | 22 kB | 12/17 kB
  2936. Progress (4): 147/274 kB | 8.8 kB | 22 kB | 16/17 kB
  2937. Progress (4): 147/274 kB | 8.8 kB | 22 kB | 17 kB
  2938. Progress (4): 152/274 kB | 8.8 kB | 22 kB | 17 kB
  2939.  
  2940. Downloaded from central: https://repo.maven.apache.org/maven2/org/slf4j/slf4j-jdk14/1.5.6/slf4j-jdk14-1.5.6.jar (8.8 kB at 1.6 kB/s)
  2941. Progress (4): 152/274 kB | 22 kB | 17 kB | 4.1/11 kB
  2942. Progress (4): 156/274 kB | 22 kB | 17 kB | 4.1/11 kB
  2943.  
  2944. Downloaded from central: https://repo.maven.apache.org/maven2/org/slf4j/slf4j-api/1.5.6/slf4j-api-1.5.6.jar (22 kB at 4.1 kB/s)
  2945. Progress (3): 156/274 kB | 17 kB | 8.2/11 kB
  2946.  
  2947. Downloaded from central: https://repo.maven.apache.org/maven2/org/slf4j/jcl-over-slf4j/1.5.6/jcl-over-slf4j-1.5.6.jar (17 kB at 3.1 kB/s)
  2948. Downloading from central: https://repo.maven.apache.org/maven2/org/apache/maven/maven-monitor/2.2.1/maven-monitor-2.2.1.jar
  2949. Downloading from central: https://repo.maven.apache.org/maven2/org/apache/maven/maven-repository-metadata/2.2.1/maven-repository-metadata-2.2.1.jar
  2950. Progress (2): 156/274 kB | 11 kB
  2951.  
  2952. Downloading from central: https://repo.maven.apache.org/maven2/org/apache/maven/maven-error-diagnostics/2.2.1/maven-error-diagnostics-2.2.1.jar
  2953. Progress (2): 160/274 kB | 11 kB
  2954. Progress (2): 164/274 kB | 11 kB
  2955. Progress (2): 168/274 kB | 11 kB
  2956. Progress (2): 172/274 kB | 11 kB
  2957. Progress (2): 176/274 kB | 11 kB
  2958. Progress (2): 180/274 kB | 11 kB
  2959. Progress (3): 180/274 kB | 11 kB | 4.1/10 kB
  2960. Progress (3): 180/274 kB | 11 kB | 8.2/10 kB
  2961. Progress (3): 180/274 kB | 11 kB | 10 kB
  2962. Progress (4): 180/274 kB | 11 kB | 10 kB | 4.1/26 kB
  2963. Progress (4): 180/274 kB | 11 kB | 10 kB | 8.2/26 kB
  2964. Progress (4): 180/274 kB | 11 kB | 10 kB | 12/26 kB
  2965. Progress (4): 180/274 kB | 11 kB | 10 kB | 16/26 kB
  2966.  
  2967. Downloaded from central: https://repo.maven.apache.org/maven2/org/apache/maven/reporting/maven-reporting-api/3.0/maven-reporting-api-3.0.jar (11 kB at 1.9 kB/s)
  2968. Downloading from central: https://repo.maven.apache.org/maven2/org/sonatype/plexus/plexus-sec-dispatcher/1.3/plexus-sec-dispatcher-1.3.jar
  2969. Progress (3): 180/274 kB | 10 kB | 20/26 kB
  2970. Progress (4): 180/274 kB | 10 kB | 20/26 kB | 4.1/13 kB
  2971. Progress (4): 180/274 kB | 10 kB | 25/26 kB | 4.1/13 kB
  2972. Progress (4): 180/274 kB | 10 kB | 26 kB | 4.1/13 kB
  2973. Progress (4): 180/274 kB | 10 kB | 26 kB | 8.2/13 kB
  2974. Progress (4): 180/274 kB | 10 kB | 26 kB | 12/13 kB
  2975. Progress (4): 180/274 kB | 10 kB | 26 kB | 13 kB
  2976.  
  2977. Downloaded from central: https://repo.maven.apache.org/maven2/org/apache/maven/maven-monitor/2.2.1/maven-monitor-2.2.1.jar (10 kB at 1.7 kB/s)
  2978. Downloading from central: https://repo.maven.apache.org/maven2/org/sonatype/plexus/plexus-cipher/1.4/plexus-cipher-1.4.jar
  2979. Progress (4): 180/274 kB | 26 kB | 13 kB | 4.1/29 kB
  2980. Progress (4): 180/274 kB | 26 kB | 13 kB | 8.2/29 kB
  2981. Progress (4): 180/274 kB | 26 kB | 13 kB | 12/29 kB
  2982. Progress (4): 180/274 kB | 26 kB | 13 kB | 16/29 kB
  2983. Progress (4): 180/274 kB | 26 kB | 13 kB | 20/29 kB
  2984. Progress (4): 180/274 kB | 26 kB | 13 kB | 25/29 kB
  2985. Progress (4): 180/274 kB | 26 kB | 13 kB | 29 kB
  2986.  
  2987. Downloaded from central: https://repo.maven.apache.org/maven2/org/apache/maven/maven-repository-metadata/2.2.1/maven-repository-metadata-2.2.1.jar (26 kB at 4.1 kB/s)
  2988. Downloaded from central: https://repo.maven.apache.org/maven2/org/apache/maven/maven-error-diagnostics/2.2.1/maven-error-diagnostics-2.2.1.jar (13 kB at 2.1 kB/s)
  2989. Downloading from central: https://repo.maven.apache.org/maven2/org/apache/commons/commons-lang3/3.1/commons-lang3-3.1.jar
  2990. Downloading from central: https://repo.maven.apache.org/maven2/org/apache/maven/surefire/surefire-api/2.18.1/surefire-api-2.18.1.jar
  2991. Downloaded from central: https://repo.maven.apache.org/maven2/org/sonatype/plexus/plexus-sec-dispatcher/1.3/plexus-sec-dispatcher-1.3.jar (29 kB at 4.2 kB/s)
  2992. Downloading from central: https://repo.maven.apache.org/maven2/org/apache/maven/maven-toolchain/2.2.1/maven-toolchain-2.2.1.jar
  2993. Progress (2): 180/274 kB | 4.1/13 kB
  2994. Progress (3): 180/274 kB | 4.1/13 kB | 4.1/316 kB
  2995. Progress (3): 180/274 kB | 8.2/13 kB | 4.1/316 kB
  2996. Progress (3): 180/274 kB | 8.2/13 kB | 8.2/316 kB
  2997. Progress (3): 180/274 kB | 8.2/13 kB | 12/316 kB
  2998. Progress (3): 180/274 kB | 12/13 kB | 12/316 kB
  2999. Progress (3): 180/274 kB | 12/13 kB | 16/316 kB
  3000. Progress (3): 180/274 kB | 13 kB | 16/316 kB
  3001. Progress (4): 180/274 kB | 13 kB | 16/316 kB | 4.1/148 kB
  3002. Progress (4): 180/274 kB | 13 kB | 16/316 kB | 8.2/148 kB
  3003. Progress (4): 180/274 kB | 13 kB | 16/316 kB | 12/148 kB
  3004. Progress (4): 180/274 kB | 13 kB | 16/316 kB | 16/148 kB
  3005. Progress (4): 180/274 kB | 13 kB | 16/316 kB | 20/148 kB
  3006. Progress (4): 180/274 kB | 13 kB | 16/316 kB | 25/148 kB
  3007. Progress (4): 180/274 kB | 13 kB | 16/316 kB | 29/148 kB
  3008. Progress (4): 180/274 kB | 13 kB | 16/316 kB | 33/148 kB
  3009. Progress (4): 180/274 kB | 13 kB | 16/316 kB | 37/148 kB
  3010. Progress (4): 180/274 kB | 13 kB | 16/316 kB | 41/148 kB
  3011. Progress (4): 180/274 kB | 13 kB | 16/316 kB | 45/148 kB
  3012. Progress (4): 180/274 kB | 13 kB | 16/316 kB | 49/148 kB
  3013. Progress (4): 180/274 kB | 13 kB | 16/316 kB | 53/148 kB
  3014. Progress (4): 180/274 kB | 13 kB | 16/316 kB | 57/148 kB
  3015. Progress (4): 180/274 kB | 13 kB | 16/316 kB | 61/148 kB
  3016. Progress (4): 180/274 kB | 13 kB | 16/316 kB | 66/148 kB
  3017. Progress (4): 184/274 kB | 13 kB | 16/316 kB | 66/148 kB
  3018. Progress (4): 188/274 kB | 13 kB | 16/316 kB | 66/148 kB
  3019. Progress (4): 193/274 kB | 13 kB | 16/316 kB | 66/148 kB
  3020. Progress (4): 197/274 kB | 13 kB | 16/316 kB | 66/148 kB
  3021. Progress (4): 197/274 kB | 13 kB | 20/316 kB | 66/148 kB
  3022. Progress (4): 197/274 kB | 13 kB | 25/316 kB | 66/148 kB
  3023. Progress (4): 197/274 kB | 13 kB | 25/316 kB | 70/148 kB
  3024. Progress (4): 197/274 kB | 13 kB | 29/316 kB | 70/148 kB
  3025. Progress (4): 197/274 kB | 13 kB | 29/316 kB | 74/148 kB
  3026. Progress (4): 197/274 kB | 13 kB | 33/316 kB | 74/148 kB
  3027. Progress (4): 197/274 kB | 13 kB | 33/316 kB | 78/148 kB
  3028. Progress (4): 197/274 kB | 13 kB | 33/316 kB | 82/148 kB
  3029. Progress (4): 197/274 kB | 13 kB | 37/316 kB | 82/148 kB
  3030. Progress (4): 197/274 kB | 13 kB | 41/316 kB | 82/148 kB
  3031. Progress (4): 197/274 kB | 13 kB | 45/316 kB | 82/148 kB
  3032. Progress (4): 197/274 kB | 13 kB | 49/316 kB | 82/148 kB
  3033. Progress (4): 197/274 kB | 13 kB | 49/316 kB | 86/148 kB
  3034. Progress (4): 197/274 kB | 13 kB | 49/316 kB | 90/148 kB
  3035. Progress (4): 197/274 kB | 13 kB | 49/316 kB | 94/148 kB
  3036. Progress (4): 197/274 kB | 13 kB | 49/316 kB | 98/148 kB
  3037. Progress (4): 197/274 kB | 13 kB | 49/316 kB | 102/148 kB
  3038. Progress (4): 197/274 kB | 13 kB | 49/316 kB | 106/148 kB
  3039. Progress (4): 197/274 kB | 13 kB | 49/316 kB | 111/148 kB
  3040. Progress (4): 197/274 kB | 13 kB | 49/316 kB | 115/148 kB
  3041. Progress (4): 197/274 kB | 13 kB | 49/316 kB | 119/148 kB
  3042. Progress (4): 197/274 kB | 13 kB | 49/316 kB | 123/148 kB
  3043. Progress (4): 197/274 kB | 13 kB | 49/316 kB | 127/148 kB
  3044. Progress (4): 197/274 kB | 13 kB | 49/316 kB | 131/148 kB
  3045. Progress (5): 197/274 kB | 13 kB | 49/316 kB | 131/148 kB | 4.1/38 kB
  3046. Progress (5): 197/274 kB | 13 kB | 49/316 kB | 131/148 kB | 8.2/38 kB
  3047. Progress (5): 197/274 kB | 13 kB | 49/316 kB | 131/148 kB | 12/38 kB
  3048. Progress (5): 197/274 kB | 13 kB | 49/316 kB | 131/148 kB | 16/38 kB
  3049. Progress (5): 197/274 kB | 13 kB | 49/316 kB | 131/148 kB | 20/38 kB
  3050. Progress (5): 197/274 kB | 13 kB | 49/316 kB | 131/148 kB | 25/38 kB
  3051. Progress (5): 197/274 kB | 13 kB | 49/316 kB | 131/148 kB | 29/38 kB
  3052. Progress (5): 197/274 kB | 13 kB | 49/316 kB | 131/148 kB | 33/38 kB
  3053. Progress (5): 197/274 kB | 13 kB | 49/316 kB | 131/148 kB | 37/38 kB
  3054. Progress (5): 197/274 kB | 13 kB | 49/316 kB | 131/148 kB | 38 kB
  3055.  
  3056. Downloaded from central: https://repo.maven.apache.org/maven2/org/sonatype/plexus/plexus-cipher/1.4/plexus-cipher-1.4.jar (13 kB at 1.9 kB/s)
  3057. Downloading from central: https://repo.maven.apache.org/maven2/org/apache/maven/plugin-tools/maven-plugin-annotations/3.3/maven-plugin-annotations-3.3.jar
  3058. Progress (4): 201/274 kB | 49/316 kB | 131/148 kB | 38 kB
  3059. Progress (4): 205/274 kB | 49/316 kB | 131/148 kB | 38 kB
  3060. Progress (4): 209/274 kB | 49/316 kB | 131/148 kB | 38 kB
  3061. Progress (4): 213/274 kB | 49/316 kB | 131/148 kB | 38 kB
  3062. Progress (4): 213/274 kB | 49/316 kB | 135/148 kB | 38 kB
  3063. Progress (4): 213/274 kB | 49/316 kB | 139/148 kB | 38 kB
  3064. Progress (4): 213/274 kB | 49/316 kB | 143/148 kB | 38 kB
  3065. Progress (4): 213/274 kB | 49/316 kB | 147/148 kB | 38 kB
  3066. Progress (4): 213/274 kB | 49/316 kB | 148 kB | 38 kB
  3067. Progress (4): 213/274 kB | 53/316 kB | 148 kB | 38 kB
  3068. Progress (4): 213/274 kB | 57/316 kB | 148 kB | 38 kB
  3069. Progress (4): 213/274 kB | 61/316 kB | 148 kB | 38 kB
  3070. Progress (4): 213/274 kB | 66/316 kB | 148 kB | 38 kB
  3071. Progress (4): 213/274 kB | 70/316 kB | 148 kB | 38 kB
  3072. Progress (4): 213/274 kB | 74/316 kB | 148 kB | 38 kB
  3073. Progress (4): 213/274 kB | 78/316 kB | 148 kB | 38 kB
  3074. Progress (4): 213/274 kB | 82/316 kB | 148 kB | 38 kB
  3075.  
  3076. Downloaded from central: https://repo.maven.apache.org/maven2/org/apache/maven/maven-toolchain/2.2.1/maven-toolchain-2.2.1.jar (38 kB at 5.1 kB/s)
  3077. Progress (4): 213/274 kB | 82/316 kB | 148 kB | 4.1/14 kB
  3078. Progress (4): 213/274 kB | 82/316 kB | 148 kB | 8.2/14 kB
  3079. Progress (4): 213/274 kB | 82/316 kB | 148 kB | 12/14 kB
  3080. Progress (4): 213/274 kB | 82/316 kB | 148 kB | 14 kB
  3081. Progress (4): 217/274 kB | 82/316 kB | 148 kB | 14 kB
  3082. Progress (4): 221/274 kB | 82/316 kB | 148 kB | 14 kB
  3083. Progress (4): 225/274 kB | 82/316 kB | 148 kB | 14 kB
  3084. Progress (4): 229/274 kB | 82/316 kB | 148 kB | 14 kB
  3085.  
  3086. Downloaded from central: https://repo.maven.apache.org/maven2/org/apache/maven/surefire/surefire-api/2.18.1/surefire-api-2.18.1.jar (148 kB at 19 kB/s)
  3087. Progress (3): 229/274 kB | 86/316 kB | 14 kB
  3088.  
  3089. Downloaded from central: https://repo.maven.apache.org/maven2/org/apache/maven/plugin-tools/maven-plugin-annotations/3.3/maven-plugin-annotations-3.3.jar (14 kB at 1.8 kB/s)
  3090. Progress (2): 229/274 kB | 90/316 kB
  3091. Progress (2): 229/274 kB | 94/316 kB
  3092. Progress (2): 229/274 kB | 98/316 kB
  3093. Progress (2): 229/274 kB | 102/316 kB
  3094. Progress (2): 229/274 kB | 106/316 kB
  3095. Progress (2): 229/274 kB | 111/316 kB
  3096. Progress (2): 229/274 kB | 115/316 kB
  3097. Progress (2): 229/274 kB | 119/316 kB
  3098. Progress (2): 229/274 kB | 123/316 kB
  3099. Progress (2): 229/274 kB | 127/316 kB
  3100. Progress (2): 229/274 kB | 131/316 kB
  3101. Progress (2): 233/274 kB | 131/316 kB
  3102. Progress (2): 238/274 kB | 131/316 kB
  3103. Progress (2): 242/274 kB | 131/316 kB
  3104. Progress (2): 246/274 kB | 131/316 kB
  3105. Progress (2): 246/274 kB | 135/316 kB
  3106. Progress (2): 246/274 kB | 139/316 kB
  3107. Progress (2): 246/274 kB | 143/316 kB
  3108. Progress (2): 246/274 kB | 147/316 kB
  3109. Progress (2): 246/274 kB | 152/316 kB
  3110. Progress (2): 246/274 kB | 156/316 kB
  3111. Progress (2): 246/274 kB | 160/316 kB
  3112. Progress (2): 246/274 kB | 164/316 kB
  3113. Progress (2): 250/274 kB | 164/316 kB
  3114. Progress (2): 254/274 kB | 164/316 kB
  3115. Progress (2): 258/274 kB | 164/316 kB
  3116. Progress (2): 262/274 kB | 164/316 kB
  3117. Progress (2): 262/274 kB | 168/316 kB
  3118. Progress (2): 262/274 kB | 172/316 kB
  3119. Progress (2): 262/274 kB | 176/316 kB
  3120. Progress (2): 262/274 kB | 180/316 kB
  3121. Progress (2): 262/274 kB | 184/316 kB
  3122. Progress (2): 262/274 kB | 188/316 kB
  3123. Progress (2): 262/274 kB | 193/316 kB
  3124. Progress (2): 262/274 kB | 197/316 kB
  3125. Progress (2): 262/274 kB | 201/316 kB
  3126. Progress (2): 262/274 kB | 205/316 kB
  3127. Progress (2): 266/274 kB | 205/316 kB
  3128. Progress (2): 266/274 kB | 209/316 kB
  3129. Progress (2): 270/274 kB | 209/316 kB
  3130. Progress (2): 270/274 kB | 213/316 kB
  3131. Progress (2): 274/274 kB | 213/316 kB
  3132. Progress (2): 274 kB | 213/316 kB
  3133. Progress (2): 274 kB | 217/316 kB
  3134. Progress (2): 274 kB | 221/316 kB
  3135. Progress (2): 274 kB | 225/316 kB
  3136. Progress (2): 274 kB | 229/316 kB
  3137. Progress (2): 274 kB | 233/316 kB
  3138. Progress (2): 274 kB | 238/316 kB
  3139. Progress (2): 274 kB | 242/316 kB
  3140. Progress (2): 274 kB | 246/316 kB
  3141. Progress (2): 274 kB | 250/316 kB
  3142. Progress (2): 274 kB | 254/316 kB
  3143. Progress (2): 274 kB | 258/316 kB
  3144. Progress (2): 274 kB | 262/316 kB
  3145.  
  3146. Downloaded from central: https://repo.maven.apache.org/maven2/org/apache/maven/surefire/maven-surefire-common/2.18.1/maven-surefire-common-2.18.1.jar (274 kB at 30 kB/s)
  3147. Progress (1): 266/316 kB
  3148. Progress (1): 270/316 kB
  3149. Progress (1): 274/316 kB
  3150. Progress (1): 279/316 kB
  3151. Progress (1): 283/316 kB
  3152. Progress (1): 287/316 kB
  3153. Progress (1): 291/316 kB
  3154. Progress (1): 295/316 kB
  3155. Progress (1): 299/316 kB
  3156. Progress (1): 303/316 kB
  3157. Progress (1): 307/316 kB
  3158. Progress (1): 311/316 kB
  3159. Progress (1): 315/316 kB
  3160. Progress (1): 316 kB
  3161.  
  3162. Downloaded from central: https://repo.maven.apache.org/maven2/org/apache/commons/commons-lang3/3.1/commons-lang3-3.1.jar (316 kB at 31 kB/s)
  3163. [INFO] Surefire report directory: /root/.jenkins/workspace/jenkins_pipeline_demo/target/surefire-reports
  3164. Downloading from central: https://repo.maven.apache.org/maven2/org/apache/maven/surefire/surefire-junit4/2.18.1/surefire-junit4-2.18.1.pom
  3165. Progress (1): 2.5 kB
  3166.  
  3167. Downloaded from central: https://repo.maven.apache.org/maven2/org/apache/maven/surefire/surefire-junit4/2.18.1/surefire-junit4-2.18.1.pom (2.5 kB at 3.1 kB/s)
  3168. Downloading from central: https://repo.maven.apache.org/maven2/org/apache/maven/surefire/surefire-providers/2.18.1/surefire-providers-2.18.1.pom
  3169. Progress (1): 2.5 kB
  3170.  
  3171. Downloaded from central: https://repo.maven.apache.org/maven2/org/apache/maven/surefire/surefire-providers/2.18.1/surefire-providers-2.18.1.pom (2.5 kB at 4.4 kB/s)
  3172. Downloading from central: https://repo.maven.apache.org/maven2/org/apache/maven/surefire/surefire-junit4/2.18.1/surefire-junit4-2.18.1.jar
  3173. Progress (1): 4.1/68 kB
  3174. Progress (1): 8.2/68 kB
  3175. Progress (1): 12/68 kB
  3176. Progress (1): 16/68 kB
  3177. Progress (1): 20/68 kB
  3178. Progress (1): 25/68 kB
  3179. Progress (1): 29/68 kB
  3180. Progress (1): 33/68 kB
  3181. Progress (1): 37/68 kB
  3182. Progress (1): 41/68 kB
  3183. Progress (1): 45/68 kB
  3184. Progress (1): 49/68 kB
  3185. Progress (1): 53/68 kB
  3186. Progress (1): 57/68 kB
  3187. Progress (1): 61/68 kB
  3188. Progress (1): 66/68 kB
  3189. Progress (1): 68 kB
  3190.  
  3191. Downloaded from central: https://repo.maven.apache.org/maven2/org/apache/maven/surefire/surefire-junit4/2.18.1/surefire-junit4-2.18.1.jar (68 kB at 66 kB/s)
  3192.  
  3193. -------------------------------------------------------
  3194. T E S T S
  3195. -------------------------------------------------------
  3196. Running test.SomeTest
  3197. Tests run: 6, Failures: 1, Errors: 0, Skipped: 0, Time elapsed: 0.004 sec <<< FAILURE! - in test.SomeTest
  3198. test3(test.SomeTest) Time elapsed: 0.001 sec <<< FAILURE!
  3199. java.lang.AssertionError: oops
  3200. at org.junit.Assert.fail(Assert.java:88)
  3201. at test.Base.run(Base.java:35)
  3202. at test.SomeTest.test3(SomeTest.java:40)
  3203.  
  3204. Running test.OtherTest
  3205. Tests run: 1, Failures: 0, Errors: 0, Skipped: 0, Time elapsed: 0.002 sec - in test.OtherTest
  3206.  
  3207. Results :
  3208.  
  3209. Failed tests:
  3210. SomeTest.test3:40->Base.run:35 oops
  3211.  
  3212. Tests run: 7, Failures: 1, Errors: 0, Skipped: 0
  3213.  
  3214. [ERROR] There are test failures.
  3215.  
  3216. Please refer to /root/.jenkins/workspace/jenkins_pipeline_demo/target/surefire-reports for the individual test results.
  3217. [INFO]
  3218. [INFO] --- maven-jar-plugin:2.4:jar (default-jar) @ simple-maven-project-with-tests ---
  3219. Downloading from central: https://repo.maven.apache.org/maven2/org/apache/maven/maven-archiver/2.5/maven-archiver-2.5.pom
  3220. Progress (1): 4.1/4.5 kB
  3221. Progress (1): 4.5 kB
  3222.  
  3223. Downloaded from central: https://repo.maven.apache.org/maven2/org/apache/maven/maven-archiver/2.5/maven-archiver-2.5.pom (4.5 kB at 7.5 kB/s)
  3224. Downloading from central: https://repo.maven.apache.org/maven2/org/codehaus/plexus/plexus-archiver/2.1/plexus-archiver-2.1.pom
  3225. Progress (1): 2.8 kB
  3226.  
  3227. Downloaded from central: https://repo.maven.apache.org/maven2/org/codehaus/plexus/plexus-archiver/2.1/plexus-archiver-2.1.pom (2.8 kB at 4.3 kB/s)
  3228. Downloading from central: https://repo.maven.apache.org/maven2/org/codehaus/plexus/plexus-io/2.0.2/plexus-io-2.0.2.pom
  3229. Progress (1): 1.7 kB
  3230.  
  3231. Downloaded from central: https://repo.maven.apache.org/maven2/org/codehaus/plexus/plexus-io/2.0.2/plexus-io-2.0.2.pom (1.7 kB at 2.4 kB/s)
  3232. Downloading from central: https://repo.maven.apache.org/maven2/org/codehaus/plexus/plexus-components/1.1.19/plexus-components-1.1.19.pom
  3233. Progress (1): 2.7 kB
  3234.  
  3235. Downloaded from central: https://repo.maven.apache.org/maven2/org/codehaus/plexus/plexus-components/1.1.19/plexus-components-1.1.19.pom (2.7 kB at 4.5 kB/s)
  3236. Downloading from central: https://repo.maven.apache.org/maven2/org/codehaus/plexus/plexus/3.0.1/plexus-3.0.1.pom
  3237. Progress (1): 4.1/19 kB
  3238. Progress (1): 8.2/19 kB
  3239. Progress (1): 12/19 kB
  3240. Progress (1): 16/19 kB
  3241. Progress (1): 19 kB
  3242.  
  3243. Downloaded from central: https://repo.maven.apache.org/maven2/org/codehaus/plexus/plexus/3.0.1/plexus-3.0.1.pom (19 kB at 13 kB/s)
  3244. Downloading from central: https://repo.maven.apache.org/maven2/org/codehaus/plexus/plexus-interpolation/1.15/plexus-interpolation-1.15.pom
  3245. Progress (1): 1.0 kB
  3246.  
  3247. Downloaded from central: https://repo.maven.apache.org/maven2/org/codehaus/plexus/plexus-interpolation/1.15/plexus-interpolation-1.15.pom (1.0 kB at 1.4 kB/s)
  3248. Downloading from central: https://repo.maven.apache.org/maven2/commons-lang/commons-lang/2.1/commons-lang-2.1.pom
  3249. Progress (1): 4.1/9.9 kB
  3250. Progress (1): 8.2/9.9 kB
  3251. Progress (1): 9.9 kB
  3252.  
  3253. Downloaded from central: https://repo.maven.apache.org/maven2/commons-lang/commons-lang/2.1/commons-lang-2.1.pom (9.9 kB at 18 kB/s)
  3254. Downloading from central: https://repo.maven.apache.org/maven2/classworlds/classworlds/1.1-alpha-2/classworlds-1.1-alpha-2.jar
  3255. Downloading from central: https://repo.maven.apache.org/maven2/org/apache/maven/maven-archiver/2.5/maven-archiver-2.5.jar
  3256. Downloading from central: https://repo.maven.apache.org/maven2/org/codehaus/plexus/plexus-archiver/2.1/plexus-archiver-2.1.jar
  3257. Downloading from central: https://repo.maven.apache.org/maven2/org/codehaus/plexus/plexus-interpolation/1.15/plexus-interpolation-1.15.jar
  3258. Downloading from central: https://repo.maven.apache.org/maven2/org/codehaus/plexus/plexus-io/2.0.2/plexus-io-2.0.2.jar
  3259. Progress (1): 4.1/38 kB
  3260. Progress (1): 8.2/38 kB
  3261. Progress (1): 12/38 kB
  3262. Progress (1): 16/38 kB
  3263. Progress (1): 20/38 kB
  3264. Progress (1): 25/38 kB
  3265. Progress (1): 29/38 kB
  3266. Progress (1): 33/38 kB
  3267. Progress (2): 33/38 kB | 4.1/184 kB
  3268. Progress (2): 33/38 kB | 8.2/184 kB
  3269. Progress (2): 33/38 kB | 12/184 kB
  3270. Progress (2): 33/38 kB | 16/184 kB
  3271. Progress (2): 33/38 kB | 20/184 kB
  3272. Progress (3): 33/38 kB | 20/184 kB | 4.1/58 kB
  3273. Progress (3): 33/38 kB | 25/184 kB | 4.1/58 kB
  3274. Progress (3): 33/38 kB | 29/184 kB | 4.1/58 kB
  3275. Progress (3): 33/38 kB | 33/184 kB | 4.1/58 kB
  3276. Progress (4): 33/38 kB | 33/184 kB | 4.1/58 kB | 4.1/60 kB
  3277. Progress (4): 33/38 kB | 33/184 kB | 4.1/58 kB | 8.2/60 kB
  3278. Progress (4): 33/38 kB | 33/184 kB | 8.2/58 kB | 8.2/60 kB
  3279. Progress (4): 33/38 kB | 33/184 kB | 8.2/58 kB | 12/60 kB
  3280. Progress (4): 33/38 kB | 37/184 kB | 8.2/58 kB | 12/60 kB
  3281. Progress (4): 33/38 kB | 37/184 kB | 8.2/58 kB | 16/60 kB
  3282. Progress (4): 33/38 kB | 37/184 kB | 8.2/58 kB | 20/60 kB
  3283. Progress (4): 33/38 kB | 37/184 kB | 8.2/58 kB | 25/60 kB
  3284. Progress (4): 33/38 kB | 37/184 kB | 12/58 kB | 25/60 kB
  3285. Progress (4): 33/38 kB | 37/184 kB | 12/58 kB | 29/60 kB
  3286. Progress (4): 33/38 kB | 37/184 kB | 12/58 kB | 33/60 kB
  3287. Progress (4): 33/38 kB | 41/184 kB | 12/58 kB | 33/60 kB
  3288. Progress (4): 33/38 kB | 41/184 kB | 12/58 kB | 37/60 kB
  3289. Progress (4): 33/38 kB | 41/184 kB | 12/58 kB | 41/60 kB
  3290. Progress (4): 33/38 kB | 41/184 kB | 12/58 kB | 45/60 kB
  3291. Progress (4): 33/38 kB | 41/184 kB | 16/58 kB | 45/60 kB
  3292. Progress (4): 33/38 kB | 41/184 kB | 16/58 kB | 49/60 kB
  3293. Progress (4): 33/38 kB | 41/184 kB | 20/58 kB | 49/60 kB
  3294. Progress (4): 33/38 kB | 45/184 kB | 20/58 kB | 49/60 kB
  3295. Progress (4): 33/38 kB | 45/184 kB | 25/58 kB | 49/60 kB
  3296. Progress (4): 33/38 kB | 45/184 kB | 25/58 kB | 53/60 kB
  3297. Progress (4): 33/38 kB | 45/184 kB | 29/58 kB | 53/60 kB
  3298. Progress (4): 33/38 kB | 49/184 kB | 29/58 kB | 53/60 kB
  3299. Progress (4): 33/38 kB | 49/184 kB | 33/58 kB | 53/60 kB
  3300. Progress (4): 33/38 kB | 49/184 kB | 33/58 kB | 57/60 kB
  3301. Progress (4): 33/38 kB | 49/184 kB | 33/58 kB | 60 kB
  3302. Progress (4): 33/38 kB | 49/184 kB | 37/58 kB | 60 kB
  3303. Progress (4): 33/38 kB | 49/184 kB | 41/58 kB | 60 kB
  3304. Progress (4): 33/38 kB | 49/184 kB | 45/58 kB | 60 kB
  3305. Progress (4): 33/38 kB | 49/184 kB | 49/58 kB | 60 kB
  3306. Progress (4): 33/38 kB | 49/184 kB | 53/58 kB | 60 kB
  3307. Progress (4): 33/38 kB | 49/184 kB | 57/58 kB | 60 kB
  3308. Progress (4): 33/38 kB | 49/184 kB | 58 kB | 60 kB
  3309. Progress (4): 37/38 kB | 49/184 kB | 58 kB | 60 kB
  3310. Progress (4): 38 kB | 49/184 kB | 58 kB | 60 kB
  3311. Progress (5): 38 kB | 49/184 kB | 58 kB | 60 kB | 4.1/22 kB
  3312. Progress (5): 38 kB | 53/184 kB | 58 kB | 60 kB | 4.1/22 kB
  3313. Progress (5): 38 kB | 53/184 kB | 58 kB | 60 kB | 8.2/22 kB
  3314. Progress (5): 38 kB | 57/184 kB | 58 kB | 60 kB | 8.2/22 kB
  3315. Progress (5): 38 kB | 57/184 kB | 58 kB | 60 kB | 12/22 kB
  3316. Progress (5): 38 kB | 61/184 kB | 58 kB | 60 kB | 12/22 kB
  3317. Progress (5): 38 kB | 61/184 kB | 58 kB | 60 kB | 16/22 kB
  3318. Progress (5): 38 kB | 66/184 kB | 58 kB | 60 kB | 16/22 kB
  3319. Progress (5): 38 kB | 66/184 kB | 58 kB | 60 kB | 20/22 kB
  3320. Progress (5): 38 kB | 66/184 kB | 58 kB | 60 kB | 22 kB
  3321.  
  3322. Downloaded from central: https://repo.maven.apache.org/maven2/org/codehaus/plexus/plexus-io/2.0.2/plexus-io-2.0.2.jar (58 kB at 71 kB/s)
  3323. Downloading from central: https://repo.maven.apache.org/maven2/commons-lang/commons-lang/2.1/commons-lang-2.1.jar
  3324. Progress (4): 38 kB | 70/184 kB | 60 kB | 22 kB
  3325.  
  3326. Downloaded from central: https://repo.maven.apache.org/maven2/org/codehaus/plexus/plexus-interpolation/1.15/plexus-interpolation-1.15.jar (60 kB at 73 kB/s)
  3327. Progress (3): 38 kB | 74/184 kB | 22 kB
  3328. Progress (3): 38 kB | 78/184 kB | 22 kB
  3329. Progress (3): 38 kB | 82/184 kB | 22 kB
  3330. Progress (3): 38 kB | 86/184 kB | 22 kB
  3331. Progress (3): 38 kB | 90/184 kB | 22 kB
  3332. Progress (3): 38 kB | 94/184 kB | 22 kB
  3333. Progress (3): 38 kB | 98/184 kB | 22 kB
  3334. Progress (3): 38 kB | 102/184 kB | 22 kB
  3335. Progress (3): 38 kB | 106/184 kB | 22 kB
  3336. Progress (3): 38 kB | 111/184 kB | 22 kB
  3337. Progress (3): 38 kB | 115/184 kB | 22 kB
  3338. Progress (3): 38 kB | 119/184 kB | 22 kB
  3339. Progress (3): 38 kB | 123/184 kB | 22 kB
  3340. Progress (3): 38 kB | 127/184 kB | 22 kB
  3341. Progress (3): 38 kB | 131/184 kB | 22 kB
  3342.  
  3343. Downloaded from central: https://repo.maven.apache.org/maven2/classworlds/classworlds/1.1-alpha-2/classworlds-1.1-alpha-2.jar (38 kB at 34 kB/s)
  3344. Progress (2): 135/184 kB | 22 kB
  3345.  
  3346. Downloaded from central: https://repo.maven.apache.org/maven2/org/apache/maven/maven-archiver/2.5/maven-archiver-2.5.jar (22 kB at 20 kB/s)
  3347. Progress (1): 139/184 kB
  3348. Progress (1): 143/184 kB
  3349. Progress (1): 147/184 kB
  3350. Progress (2): 147/184 kB | 4.1/208 kB
  3351. Progress (2): 147/184 kB | 8.2/208 kB
  3352. Progress (2): 147/184 kB | 12/208 kB
  3353. Progress (2): 147/184 kB | 16/208 kB
  3354. Progress (2): 147/184 kB | 20/208 kB
  3355. Progress (2): 147/184 kB | 25/208 kB
  3356. Progress (2): 147/184 kB | 29/208 kB
  3357. Progress (2): 147/184 kB | 33/208 kB
  3358. Progress (2): 147/184 kB | 37/208 kB
  3359. Progress (2): 147/184 kB | 41/208 kB
  3360. Progress (2): 147/184 kB | 45/208 kB
  3361. Progress (2): 147/184 kB | 49/208 kB
  3362. Progress (2): 147/184 kB | 53/208 kB
  3363. Progress (2): 147/184 kB | 57/208 kB
  3364. Progress (2): 147/184 kB | 61/208 kB
  3365. Progress (2): 147/184 kB | 66/208 kB
  3366. Progress (2): 152/184 kB | 66/208 kB
  3367. Progress (2): 156/184 kB | 66/208 kB
  3368. Progress (2): 160/184 kB | 66/208 kB
  3369. Progress (2): 164/184 kB | 66/208 kB
  3370. Progress (2): 168/184 kB | 66/208 kB
  3371. Progress (2): 172/184 kB | 66/208 kB
  3372. Progress (2): 176/184 kB | 66/208 kB
  3373. Progress (2): 180/184 kB | 66/208 kB
  3374. Progress (2): 184/184 kB | 66/208 kB
  3375. Progress (2): 184/184 kB | 70/208 kB
  3376. Progress (2): 184 kB | 70/208 kB
  3377. Progress (2): 184 kB | 74/208 kB
  3378. Progress (2): 184 kB | 78/208 kB
  3379. Progress (2): 184 kB | 82/208 kB
  3380. Progress (2): 184 kB | 86/208 kB
  3381. Progress (2): 184 kB | 90/208 kB
  3382. Progress (2): 184 kB | 94/208 kB
  3383. Progress (2): 184 kB | 98/208 kB
  3384. Progress (2): 184 kB | 102/208 kB
  3385. Progress (2): 184 kB | 106/208 kB
  3386. Progress (2): 184 kB | 111/208 kB
  3387. Progress (2): 184 kB | 115/208 kB
  3388. Progress (2): 184 kB | 119/208 kB
  3389. Progress (2): 184 kB | 123/208 kB
  3390. Progress (2): 184 kB | 127/208 kB
  3391. Progress (2): 184 kB | 131/208 kB
  3392. Progress (2): 184 kB | 135/208 kB
  3393. Progress (2): 184 kB | 139/208 kB
  3394. Progress (2): 184 kB | 143/208 kB
  3395. Progress (2): 184 kB | 147/208 kB
  3396. Progress (2): 184 kB | 152/208 kB
  3397. Progress (2): 184 kB | 156/208 kB
  3398. Progress (2): 184 kB | 160/208 kB
  3399. Progress (2): 184 kB | 164/208 kB
  3400. Progress (2): 184 kB | 168/208 kB
  3401. Progress (2): 184 kB | 172/208 kB
  3402. Progress (2): 184 kB | 176/208 kB
  3403. Progress (2): 184 kB | 180/208 kB
  3404. Progress (2): 184 kB | 184/208 kB
  3405. Progress (2): 184 kB | 188/208 kB
  3406. Progress (2): 184 kB | 193/208 kB
  3407. Progress (2): 184 kB | 197/208 kB
  3408. Progress (2): 184 kB | 201/208 kB
  3409. Progress (2): 184 kB | 205/208 kB
  3410. Progress (2): 184 kB | 208 kB
  3411.  
  3412. Downloaded from central: https://repo.maven.apache.org/maven2/org/codehaus/plexus/plexus-archiver/2.1/plexus-archiver-2.1.jar (184 kB at 96 kB/s)
  3413. Downloaded from central: https://repo.maven.apache.org/maven2/commons-lang/commons-lang/2.1/commons-lang-2.1.jar (208 kB at 93 kB/s)
  3414. [WARNING] JAR will be empty - no content was marked for inclusion!
  3415. [INFO] Building jar: /root/.jenkins/workspace/jenkins_pipeline_demo/target/simple-maven-project-with-tests-1.0-SNAPSHOT.jar
  3416. [INFO] ------------------------------------------------------------------------
  3417. [INFO] BUILD SUCCESS
  3418. [INFO] ------------------------------------------------------------------------
  3419. [INFO] Total time: 03:05 min
  3420. [INFO] Finished at: 2019-10-26T06:40:04-04:00
  3421. [INFO] ------------------------------------------------------------------------
  3422. [Pipeline] }
  3423. [Pipeline] // withEnv
  3424. [Pipeline] }
  3425. [Pipeline] // stage
  3426. [Pipeline] stage
  3427. [Pipeline] { (Results)
  3428. [Pipeline] junit
  3429. Recording test results
  3430. [Pipeline] archiveArtifacts
  3431. Archiving artifacts
  3432. [Pipeline] }
  3433. [Pipeline] // stage
  3434. [Pipeline] }
  3435. [Pipeline] // node
  3436. [Pipeline] End of Pipeline
  3437. Finished: UNSTABLE

View Cod

也可以在仪表盘看到在哪一个过程

2.5 构建结果查看

点击logs,可以看到任务

黄色是不稳定状态,重新构建一下就变成蓝色,成功状态

看趋势

基本的测试结果完成


参考文档

https://blog.xiodi.cn/2018/07/18/%e4%b8%89-jenkins%e7%9a%84%e6%96%b0%e5%8a%9f%e8%83%bd%e4%b9%8b%e4%b8%80-jenkins%e7%9a%84%e7%ae%a1%e9%81%93%e5%b7%a5%e4%bd%9c/

DEVOPS技术实践_07:Jenkins 管道工作的更多相关文章

  1. DEVOPS技术实践_09:Jenkins多分支管道

    简介 多分支的管道是在jenkins2.x中新增的功能 . 多分支管道允许你针对分布式的控制器的每个分支创建一个管道. 下图是对它的一个描述.使用jenkinsfile去创建多分支的管道,jenkin ...

  2. DEVOPS技术实践_17:Jenkins使用扩展邮件功能发送邮件

    一 环境准备 1.1 安装插件Email Extension 系统管理-管理插件-安装Email Extension插件 1.2 配置 配置jenkins邮箱的全局配置:系统管理-系统设置-完成邮箱配 ...

  3. DEVOPS技术实践_11:Jenkins集成Sonar

    前言 前面已经有介绍sonar的安装,简单应用,下面在简答的研究一下sonar和jenkins集成的简单使用,对于sonar的安装不做介绍 一 sonar的简单介绍 持续检查避免了低质量的代码,比如S ...

  4. DEVOPS技术实践_18:Jenkins的Pinpeline对于参数的使用

    因为最近使用Pipeline声明式语法构建项目,但是最近项目的参数设置较多,特地的来学习一下关于参数的调用和测试,主要式从一个大神那里学习的,结尾回贴上大神的博客链接 1 构建一个pipeline项目 ...

  5. DEVOPS技术实践_02:jenkins自动构建项目

    一.用户名密码错误 打开jenkins发现用户名密码错误,解决 1.1 找到config.xml文件 [root@jenkins-master ~]# ll -a drwxr-xr-x. root r ...

  6. DEVOPS技术实践_01:jenkins集成平台

    一.准备环境 准备三台机器 角色 IP地址 用户名 密码 jenkins-master   172.25.254.130    admin   meiyoumima gitlab 172.25.254 ...

  7. DEVOPS技术实践_12:创建持续集成的管道

    持续集成不仅包含了Jenkins或者相关其它的CI工具,也包含了包含代码如何控制,采用的什么分支策略等.不同的组织可能采用不同的类型的策略来完成CI,策略类型和项目的类型的有很大的关系. 一 分支策略 ...

  8. DEVOPS技术实践_08:声明式管道语法

    简介 前面简单的做了管道的实验,看了一下的它的效果 声明式管道是Groovy语法中的一个更简单和结构化的语法.下面主要学习明式管道语法. 一 声明式管道的基本结构 以上节的代码为例 node { de ...

  9. DEVOPS技术实践_13:使用Jenkins持续传送设计-CD基础

    1. 分支策略 持续集成中使用的分支策略包括以下三个: The master branch The integration branch The feature branch 而CD只在Integra ...

随机推荐

  1. 22-2 模板语言的进阶和fontawesome字体的使用

    一  fontfawesome字体的使用 http://fontawesome.dashgame.com/ 官网 1 下载 2 放到你的项目下面 3 html导入这个目录 实例: class最前面的f ...

  2. HDFS Concepts-blocks

  3. windows 和 linux 安装 tensorflow

    安装 跟往常一样,我们用 Conda 来安装 TensorFlow.你也许已经有了一个 TensorFlow 环境,但要确保你安装了所有必要的包. OS X 或 Linux 运行下列命令来配置开发环境 ...

  4. hdu 3272 Mission Impossible

    Mission Impossible Time Limit: 2000/1000 MS (Java/Others)    Memory Limit: 32768/32768 K (Java/Other ...

  5. H3C 快速以太网和千兆以太网

  6. echarts细节的修改(2):矩形数图,柱状图,折线图,雷达图等

    1.矩形数图的配置,是直接拿饼图的配置 然后将type换成treemap. 修改类型 option.series.type = 'treemap'; 关闭面包屑导航 option.series.bre ...

  7. java final域

    public final class ThreeStooges { /* * stooges是Set<String>类型的引用,final限定该引用成员属性stooges被赋初值后,就不能 ...

  8. js(一) 三大事件 实现注册验证

    ps:小声比比,为什么一周多没更,因为js真的好难啊. 上一周做了一整周的jsp+sevlet+mysql做了一个MVC模式的最基本的新闻系统源码会有空搞出来的 好累 好多的. 三大事件 (鼠标事件. ...

  9. P1108 分解质因数

    题目描述 给你一个正整数 \(n\) ,请给 \(n\) 分解质因数,并按照样例输出的格式输出对应的结果. 输入格式 输入包含一个正整数 \(n (2 \le n \le 10^9)\) . 输出格式 ...

  10. 2018-4-29-C#-金额转中文大写

    title author date CreateTime categories C# 金额转中文大写 lindexi 2018-04-29 09:50:38 +0800 2018-04-02 21:4 ...