ionic2:

1.创建项目:

ionic start MyIonic2Project tutorial --v2 (下载 tutorial 模板来初始化项目)

ionic start MyIonic2Project --v2 (默认会使用 tabs 模板)

2.在浏览器中运行

cd MyIonic2Project

ionic serve

3.将Ionic项目部署到模拟器或仿真器上

ionic emulate

4.添加模块(cd到指定文件夹下)

ionic g page login

5.列出用户的Ionic运行环境信息

ionic info

6.为编译Ionic应用添加一个目标平台

ionic platform add android

ionic platform add ios

7.在连接的设备上运行Ionic项目

ionic run android

ionic run ios

8.将Ionic项目针对指定的平台进行编译

ionic build android

ionic build ios

9.配置环境检测

常见问题:

Error: D:\adt\sdk\platform-tools\adb.exe: Command failed with exit code 1 Error output:
error: could not install *smartsocket* listener: cannot bind to 127.0.0.1:5037: 通常每个套接字地址(协议/网络地址/端口)只允许使用一次。 (10048)
could not read ok from ADB Server
* failed to start daemon *
error: cannot connect to daemon

解析原因:

5037端口被占用

解决方案:

方案一:

1.运行->cmd 打开命令行窗口输入:netstat -aon|findstr "5037"

2.找到占用端口号的pid:3600

如:
C:\Users\Administrator>netstat -aon|findstr "5037"
TCP 127.0.0.1:5037 0.0.0.0:0 LISTENING 3600 3.打开资源管理器结束pid=3600的进程(ctrl+shift+esc)

react-native

常见问题:

1.项目创建过程中没有问题,但执行 $ react-native run-android 报错

$ react-native run-android
Scanning 554 folders for symlinks in C:\Users\Administrator\Desktop\react-

native\newPro\node_modules (73ms)
Starting JS server...
Building and installing the app on the device (cd android && gradlew.bat

installDebug)...

FAILURE: Build failed with an exception.

* What went wrong:
A problem occurred configuring project ':app'.
> SDK location not found. Define location with sdk.dir in the local.properties

file or with an ANDROID_HOME environment variable.

* Try:
Run with --stacktrace option to get the stack trace. Run with --info or --debug

option to get more log output.

BUILD FAILED

Total time: 2 mins 31.924 secs
Could not install the app on the device, read the error above for details.
Make sure you have an Android emulator running or a device connected and have
set up your Android development environment:
https://facebook.github.io/react-native/docs/android-setup.html

原因解析:

无法找到SDK路径

解决方案:

在android文件夹下,新建 local.properties,添加路径

例:

sdk.dir = /Users/hema/Library/Android/sdk

sdk.dir = D:/adt/sdk

2.没有接受SDK组件的许可协议

Warning: License for package Android Support Repository not accepted.

FAILURE: Build failed with an exception.

* What went wrong:
A problem occurred configuring project ':app'.
> You have not accepted the license agreements of the following SDK components:
[Android Support Repository].
Before building your project, you need to accept the license agreements and

complete the installation of the missing components using the Android Studio SDK

Manager.
Alternatively, to learn how to transfer the license agreements from one

workstation to another, go to http://d.android.com/r/studio-ui/export-

licenses.html

* Try:
Run with --stacktrace option to get the stack trace. Run with --info or --debug

option to get more log output.

BUILD FAILED

Total time: 1 mins 44.091 secs
Could not install the app on the device, read the error above for details.
Make sure you have an Android emulator running or a device connected and have
set up your Android development environment:
https://facebook.github.io/react-native/docs/android-setup.html

原因解析:

没有接受SDK组件的许可协议

解决方案:

打开 SDK Manager.exe,在Extras下面找到 Android Support Repository 并 install

3.navigator 被 react-native 移除

Navigator is deprecated and has been removed from this package. It can now be installed and import from ‘react-native-deprecated-custom-components’ instead of ‘react-native’.

原因解析:

根据信息,react-native这个包中的Navigator已经被移除,而需要导入react-native-deprecated-custom-components这个包来使用Navigator。

解决方案:

1. 通过npm安装相应的库
  在项目根目录下输入npm install react-native-deprecated-custom-components --save 回车。 2. 在使用的JS文件中将Navigator引入进来,就是import
  import {Navigator} from ‘react-native-deprecated-custom-components’;

然后就可以在项目中正确使用Navigator了。

ionic2项目创建回顾 及 react-native 报错处理的更多相关文章

  1. 【问题与解决】Mac OS通过 npm 安装 React Native 报错(checkPermissions Missing write access to /usr/local/lib/node_modules)

    报错情况: 当Mac OS通过 npm 安装 React Native 报错,警告文字为:checkPermissions Missing write access to /usr/local/lib ...

  2. 使用Visual Studio Code调试React Native报错

    报错信息: [Error] Error: Unknown error: not all success patterns were matched. It means that "react ...

  3. react native报错处理com.android.build.api.transform.TransformException: com.android.builder.dexing.DexArchiveBuilderException: com.android.builder.dexing.DexArchiveBuilderException: Failed to process

    背景:最近准备在使用react-native开发的app中接入友盟,来进行用户行为统计,分享,授权登录等操作. 在使用的过程中,遇到了一些错误信息,在此记录一下. 在修改android目录下的buil ...

  4. react native 报错日常 if (_total > 0) { ~~~~~~ ^ ~ 1 error generated.

    node_modules/react-native/React/Base/RCTJavaScriptLoader.mm::: error: ordered comparison between poi ...

  5. 新maven项目创建JSP出现小红叉报错 javax.servlet.http.HttpServlet not found

    展示: 右击项目----build path -----Configure Build Path 进入到窗口 libraries -------add libraries ------  server ...

  6. React Native 报错 Error: spawn EACCES 权限

    权限不足,运行命令修改权限 chmod android/gradlew

  7. maven工程根项目运行ok但是子项目就报错的解决办法

    正常启动没错 项目出现问题 maven工程根项目运行ok但是子项目就报错 报错信息是xxxx没有创建 解决办法 原来是子项目的依赖少了  没有配置1.8  所以会出现莫明其妙的bug

  8. maven项目引用时,导入类报错,选择两个项目同时执行Maven update

    maven项目引用时,导入类报错,选择两个项目同时执行Maven update springboot引入第三方jar,需要扫描时加@ComponentScan("第三方的包名") ...

  9. vue项目初始化时npm run dev报错webpack-dev-server解决方法

    vue项目初始化时npm run dev报错webpack-dev-server解决方法 原因:这是新版webpack存在的BUG,卸载现有的新版本webpack,装老版本就好webpack-dev- ...

随机推荐

  1. Broadcom GNSS xxx Geolocaltion Sensor与Windows导航程序的兼容性(转)

    Broadcom是Windows 8(3G)平板普遍采用的一款GPS传感器, 其windows驱动程序可以提供GNSS接口.GNSS接口提供的数据,说实话确实比普通手机的数据好.在开机.室外.无AGP ...

  2. scrapy爬取段子

    scrapy.py 1.cmd运行scrapy shell http://www.baidu.com response.xpath('//div[@aa="bb"]') 找到需要匹 ...

  3. RUNAS UAC

    cookielib pip install wmi _winreg.OpenKey(_winreg.HKEY_LOCAL_MACHINE, 'SOFTWARE', 0, _winreg.KEY_ALL ...

  4. penGL入门学习(六)

    http://blog.csdn.net/sun6255028/article/details/5090067 今天要讲的是动画制作——可能是各位都很喜欢的.除了讲授知识外,我们还会让昨天那个“太阳. ...

  5. centos 资源链接

    不时更新.. 安装.启动相关 自动安装的精简的ISO 教你制作属于自己的CentOS 6.4一键自动化安装ISO镜像光盘 initrd介绍 理解 vmlinuz, initrd 和 System.ma ...

  6. 【Android开发日记】之入门篇(一)——开发环境的搭建

    写给自己的话:至此,大学的时光已经剩下一年的时光,下一年等毕业设计结束后就算是正式地踏入社会.自己学android也不过几个月的时间,为了更好管理文档,写点东西记录下自己曾经做过的点点滴滴是一个不错的 ...

  7. Python_Tips[2] -> 函数延后估值及字节码分析

    函数延后估值及字节码分析 在一个循环中定义了函数 f 但是并未对其进行调用,在循环结束后调用,此时i值为3故最终3个函数输出均为9.而非1, 4, 9. 这是由于在定义闭包函数 f 时,传入变量 i, ...

  8. 路由器漏洞利用工具RouterSploit

     路由器漏洞利用工具RouterSploit 网络中存在大量的嵌入式设备,如路由器.智能摄像头.这类设备安全防护程度较低.由于这些设备更新不方便,一旦发现漏洞,往往不能及时修复.所以,在网络渗透测试中 ...

  9. symbol(s) not found for architecture arm64

    问题如下:       解决:更改环境 ok   Standard architectures (armv7, arm7s)

  10. 用CSS3产生动画效果

    相关属性: @keyframes规则:定义动画 语法:@keyframes animationname{keyframes-selector {CSS-style;}} animationname:动 ...