mvn package的时候报如下错误:

Failed to execute goal org.apache.maven.plugins:maven-surefire-plugin:2.5:test

亲测解决方法如下:

在pom文件中添加

  1. <plugin>
  2. <groupId>org.apache.maven.plugins</groupId>
  3. <artifactId>maven-surefire-plugin</artifactId>
  4. <version>2.4.2</version>
  5. <configuration>
  6. <skipTests>true</skipTests>
  7. </configuration>
  8. </plugin>

原文链接:https://blog.csdn.net/caiwenfeng_for_23/article/details/44514947

我只试了第二种方法!!!

maven打包报错:Failed to execute goal org.apache.maven.plugins:maven-surefire-plugin:2.5:test的更多相关文章

  1. maven install 报错Failed to execute goal org.apache.maven.plugins:maven-compiler-plugin:3.1:compile (default-compile) on project*****

    [ERROR]Failed to execute goal org.apache.maven.plugins:maven-compiler-plugin:3.1:compile (default-co ...

  2. SpringBoot MAVEN编译报错Failed to execute goal org.apache.maven.plugins:maven-compiler-plugin:3.8.0:

    参考了好几篇文章没搞定,直到查询错误关键字 An unknown compilation problem occurred 分别参考了以下博客: https://blog.csdn.net/fanre ...

  3. maven install 报错 Failed to execute goal org.apache.maven.plugins:maven-surefire-plugin:2.12.4:test

    pom文件引入以下依赖 <plugin> <groupId>org.apache.maven.plugins</groupId> <artifactId> ...

  4. 在IDEA上 使用maven进行打包时报错: Failed to execute goal org.apache.maven.plugins:maven-javadoc-plugin:2.10.2:jar

    报错内容: Failed to execute goal org.apache.maven.plugins:maven-javadoc-plugin:2.10.2:jar (attach-javado ...

  5. mvn install 报错Failed to execute goal org.apache.maven.plugins:maven-compiler-plugin:2.3.2 错误: 找不到符号

    报错信息 在Eclipse中执行mvn install时,console端显示如下报错信息: [ERROR] Failed to execute goal org.apache.maven.plugi ...

  6. 安装maven工程报错"Failed to execute goal on project...Could not resolve dependencies for project..."

    我在qingcheng_interface中Lifecycle目录下执行install命令后报错"Failed to execute goal on project...Could not ...

  7. maven build时报错Failed to execute goal org.apache.maven.plugins:maven-surefire-plugin:2.12.4:test

    [INFO] BUILD FAILURE [INFO] ------------------------------------------------------------------------ ...

  8. maven install时报错 Failed to execute goal org.apache.maven.plugins:maven-surefire-plugin:2.12.4:test (default-test)

    今天在一个maven项目上执行maven install命令的时候一直报错,错误信息如下: [INFO] ----------------------------------------------- ...

  9. maven install报错 Failed to execute goal on project my-manager-mapper: Could not resolve dependencies for project com.my:my-manager-mapper:jar:0.0.1-SNAPSHOT:

    报错信息为: [ERROR] Failed to execute goal on project my-manager-mapper: Could not resolve dependencies f ...

  10. 启动Maven项目时报错Failed to execute goal org.apache.maven.plugins:maven-clean-plugin:2.5:clean (default-clean) on project **-web: Failed to clean project: Failed to delete E:\**\target\tomcat\logs\access_lo

    这类错误 出现这种错误,通常是由于您已启动了另一个tomcat 进程或者运行的javaw.exe进程,导致报错. 解决方法: 1. 鼠标点击 X 进行关闭运行失败的 Console页,(如果运行多次, ...

随机推荐

  1. jmeter获取token并请求失败Internal authentication failed 400

    jmeter访问token报错400 1.请求token地址 2.运行jmeter报错-run 3.400的意思是: 400(错误请求) 服务器不理解请求的语法. 4.报错信息如下 {"er ...

  2. Oracle bacic

    1.连接Oracle 2.操作数据库 3.单表查询 4.SUID 5.常用函数 6.集合运算 7.Oracle 对象 8.PL/SQL 9.存储函数 10.存储过程 11.触发器 1.连接到数据库 O ...

  3. spring controller 获取context

    想要获取context需要先熟悉spring是怎么在web容器中启动的,spring启动过程其实就是其IOC容器的启动过程,对于web程序,IOC容器启动过程即是建立上下文的过程 spring启动过程 ...

  4. 解决oracle导入未分配表空间的问题

    select 'alter table ' || t.TABLE_NAME || ' allocate extent;' from user_tables t order by t.TABLE_NAM ...

  5. vue-i18n

    安装 npm install vue-i18n 初始化 import VueI18n from 'vue-i18n' Vue.use(VueI18n) const messages = { zh: { ...

  6. 【ASP.NET 插件】分享一个可视化HTML编辑器 CKEditor.NET

    因为公司网站的可视化HTML编辑器IE兼容性问题,js报错不能使用,于是在网上找到了个还行的,图片本地上传的话直接把图片拖到编辑窗口就可以了.这个编辑器是在开源中国看到的,个人觉得还不错! CKEdi ...

  7. nginx 虚拟主机、反向代理服务器及负载均衡,多台主机分离php-fpm实验

    一.简介 本章介绍一些架构原理基础知识, 1.1.LNMP及php-fpm 请参考https://www.cnblogs.com/zhangxingeng/p/10242902.html 1.2.透明 ...

  8. python 如何获取当前文件/文件夹

    python 如何获取当前文件/文件夹? 1.获取当前文件的实际路劲: os.path.realpath(__file__)          ==> D:\python_test\test_p ...

  9. KMPlayer 一打开总是出现右面的窗口 导航区 怎样设置不会自动打开

    两步骤第一,右键-外观-标致-管理 删除默认标致 第二,打开hosts文件,位置在 C:\Windows\System32\drivers\etc 在最下面一行加入 127.0.0.1 player. ...

  10. 浅谈 foreach 的原理

    package com.shenzhou; import java.util.ArrayList; import java.util.Iterator; import java.util.List; ...