Execution failed for task ':compileDebugAidl'.
昨天终于升级了下Ubuntu系统到16.04LTS,之前是12.04LTS(导致内网一些同事开发的网址无法打开,以及其他工具软件无法安装)。
安装完android开发工具,运行之前的project,出现如下的错误:
- FAILURE: Build failed with an exception.
- * What went wrong:
- Execution failed for task ':compileDebugAidl'.
- > java.lang.RuntimeException: com.android.ide.common.process.ProcessException: Error while executing '/opt_dev/android-sdk-linux_new/build-tools/23.0.3/aidl' with arguments {-p/opt_dev/android-sdk-linux_new/platforms/android-/framework.aidl -o/home/dream/workspace/NewUserHomePage/build/generated/source/aidl/debug}
- * Try:
google了下,网上的错误跟这个还不一样都是missing aidl 替换或者重新安装build tools版本即可,在stackoverflow上有个人跟我一样的问题,但是没有人回复。
我以为是我的sdk的问题,这个sdk来自之前的系统安装的,所以重新下了个sdk,还是出现这样的错误。
接着怀疑是不是android studio/gradle的问题,都重新部署了,还是有问题。
后来,在android studio 中点开Gradle console,才终于找到问题所在:
- :compileDebugAidl
- /opt_dev/android-sdk-linux_new/build-tools/23.0./aidl: error while loading shared libraries: libgcc_s.so.: cannot open shared object file: No such file or directory
- /opt_dev/android-sdk-linux_new/build-tools/23.0./aidl: error while loading shared libraries: libgcc_s.so.: cannot open shared object file: No such file or directory
- FAILED
- /opt_dev/android-sdk-linux_new/build-tools/23.0./aidl: error while loading shared libraries: libgcc_s.so.: cannot open shared object file: No such file or directory
- /opt_dev/android-sdk-linux_new/build-tools/23.0./aidl: error while loading shared libraries: libgcc_s.so.: cannot open shared object file: No such file or directory
直觉是,这个aidl共享库引用了32位的libgcc_s.so,但是系统里面没有这个,所以运行如下的命令:
- sudo apt-get install lib32gcc1
重新build,OK了
奇怪的是,我之前安装过32位的兼容so了啊,可能不全吧
android sdk的很多so或者工具都是基于32位系统开发的,而Ubuntu 16.04 是64位系统(可以运行 uname -a 来查看,有x86_64的就是了),所以需要安装一些32位的so
Execution failed for task ':compileDebugAidl'.的更多相关文章
- Android Studio 中 FAILURE: Build failed with an exception. * What went wrong: Execution failed for task ':compileDebugAidl'.的问题解答
Android Studio 中 FAILURE: Build failed with an exception. * What went wrong: Execution failed for ta ...
- Error:Execution failed for task ':app:compileDebugAidl'. > java.lang.IllegalStateException: aidl is missing from '/Users/renguodong/Library/Android/sdk/build-tools/26.0.2/aidl'
错误信息:Error:Execution failed for task ':app:compileDebugAidl'. > java.lang.IllegalStateException: ...
- Error:Execution failed for task ':app:clean'.
运行时出现 Error:Execution failed for task ':app:clean'. 错误,Builld->Clean Project即可.
- Error:Execution failed for task ':app:transformClassesWithDexForDebug'.
使用android studio 时,编译成功但用build apk时却报错 环境: android studio 1.5, jdk1.7 错误:Error:Execution failed for ...
- Android Studio 运行出现 Error:Execution failed for task ':app:transformResourcesWithMergeJavaResForDebug'.
转载请标明出处: http://www.cnblogs.com/why168888/p/5978381.html 本文出自:[Edwin博客园] 我引用compile 'com.squareup.re ...
- Error:Execution failed for task ':app:transformClassesWithDexForDebug'解决记录
转载请标明出处: http://blog.csdn.net/lxk_1993/article/details/50511172 本文出自:[lxk_1993的博客]: 3个错误non-zero e ...
- Error:Execution failed for task ':app:mergeDebugResources'. > Some file crunching failed, see logs f
今天调试安卓程序遇到的问题Error:Execution failed for task ':app:mergeDebugResources'. > Some file crunching fa ...
- cordova编译报错:Execution failed for task ':processDebugResources'
cordova编译报错:Execution failed for task ':processDebugResources' 引发这个错误的最扩祸首就是一个中文命名的文件,不知道什么时候加入的,我写了 ...
- 关于vs生成app错误提示,提醒Execution failed for task ':transformClassesWithDexForDebug'.
昨天将vs和android SDK更新之后生成app之后发现app生成出错,报错如下: FAILURE: Build failed with an exception. * What went wro ...
随机推荐
- PHP远程下载图片,微信头像存到本地,本地图片转base64
方法一(推荐): function download_remote_pic($url){ $header = [ 'User-Agent: Mozilla/5.0 (Windows NT 6.1; W ...
- AtCoder Grand Contest 11~17 做题小记
原文链接https://www.cnblogs.com/zhouzhendong/p/AtCoder-Grand-Contest-from-11-to-20.html UPD(2018-11-16): ...
- BZOJ1010 [HNOI2008]玩具装箱toy 动态规划 斜率优化
原文链接http://www.cnblogs.com/zhouzhendong/p/8687797.html 题目传送门 - BZOJ1010 题意 一个数列$C$,然后把这个数列划分成若干段. 对于 ...
- java读取配置文件方法以及工具类
第一种方式 : java工具类读取配置文件工具类 只是案例代码 抓取异常以后的代码自己处理 import java.io.FileNotFoundException; import java.io. ...
- Shiro笔记(五)Shiro授权
Shiro授权 也叫访问控制,即在应用中控制谁能访问那些资源(如访问页面.编辑数据.页面操作等).在授权中需要了解几个关键对象:主体(subject).资源(resource).权限(Permissi ...
- jupyter notebook不能选择虚拟环境的解决方法
今天使用dlib没有py37版本,因此创建了Version_36虚拟环境.但jupyter notebook默认的内核找不到新建的虚拟环境,解决方法是需要安装两个包: × ipykernel × nb ...
- 003.Ansible基础使用
一 Ansible命令用法 Ansible命令行执行方式有:Ad-Hoc.Ansible-playbook两种,Web方式其官方提供付费产品Tower.Ad-Hoc主要用于临时命令的执行,Ansibl ...
- Python 合并两个列表的多种方式,合并两个字典的多种方式
一.合并列表 1.最简单的,使用+连接符: >>> a = [1,2,3] >>> b = [7,8,9] >>> a + b [1, 2, 3, ...
- String,StringBuffer与StringBuilder的区别|线程安全与线程不安全
https://www.cnblogs.com/xingzc/p/6277581.html
- 一道有意思的找规律题目 --- CodeForces - 964A
题目连接: https://vjudge.net/problem/1502082/origin 这一题第一眼看过去貌似是模拟,但是根据其范围是1e9可以知道,如果暴力解基本上是不可能的(不排除大佬级优 ...