ionic 打包的时候报了这样一个错误:Execution failed for task ':processDebugResources'

  分析:

    compile "com.android.support:support-v4:+" 带+号是指要用最新版本。

    force 'com.android.support:support-v4:27.1.0' 添加force强制指定annotations

  解决的方法就是:

  1、如果ionic platform add android了,即已经添加Android平台了,那么跳过这一步。

  2、在platforms\android下找到AndroidManifest.xml: 

  1. <uses-sdk android:minSdkVersion="16" android:targetSdkVersion="22" />

    这个是设置自己所需要的版本,我的设置为22

  3、在platforms\android下找到build.gradle,找到def promptForReleaseKeyPassword,在这个的前面添加如下语句:

    

  1. configurations.all {
  2. resolutionStrategy {
  3. force 'com.android.support:support-v4:22.0.0'
  4. }
  5. }

  4、最后ionic build android就可以成功打包了

 

ionic打包报错Execution failed for task ':processDebugResources'的更多相关文章

  1. ionic 打包 报错Execution failed for task ':processDebugResources'. > com.android.ide.common.process.ProcessException: Failed to execute aapt

    在platform --> android目录下找到build.gradle文件,打开并在def promptForReleaseKeyPassword() {...}函数前加入以下内容: 完整 ...

  2. cordova编译报错:Execution failed for task ':processDebugResources'

    cordova编译报错:Execution failed for task ':processDebugResources' 引发这个错误的最扩祸首就是一个中文命名的文件,不知道什么时候加入的,我写了 ...

  3. ANDROID打包错误ERROR:EXECUTION FAILED FOR TASK ´:APP:LINTVITALRELEASE´.

    来自:http://dditblog.com/itshare_657.html 今天修改之前的项目之后.准备打包的时候.一起打包不了.一直提示有问题.错误是一些什么Strings.xml里面的一些信息 ...

  4. Android Studio报Error:Execution failed for task &#39;:Companion:preDexDebug&#39;.

    错误例如以下: Error:Execution failed for task ':Companion:preDexDebug'. > com.android.ide.common.proces ...

  5. ionic build android--> Build failed with an exception. Execution failed for task ':processDebugResources'.

    执行 ionic build android,   ionic 自动化生成安卓apk包, 出现以上报错的原因为:打包的文件中含有中文名,把中文名的文件去掉或改名即可打包成功.

  6. [转]maven打包报错:Failed to execute goal org.apache.maven.plugins:maven-surefire-plugin:2.5:test

    源文URL:http://blog.csdn.net/caiwenfeng_for_23/article/details/44514947 mvn compile  没有问题,mvn package的 ...

  7. maven打包报错:Failed to execute goal org.apache.maven.plugins:maven-surefire-plugin:2.5:test

    mvn package的时候报如下错误: Failed to execute goal org.apache.maven.plugins:maven-surefire-plugin:2.5:test ...

  8. maven打包报错 Fatal error compiling: tools.jar not found: C:\Program Files\Java\jre1.8.0_151\..\lib\tool

    maven 打包报错  [ERROR] Failed to execute goal org.apache.maven.plugins:maven-compiler-plugin:2.5.1:comp ...

  9. android排除报很多错方法 Execution failed for task ':app:compileDebugJavaWithJavac' in Android Studio

    android排除报很多错方法1.回撤对应layout的xml改动2.回撤对应java的改动3.重命名文件后导致的资源不对应 Execution failed for task ':app:compi ...

随机推荐

  1. css 设计规范

    外部 div 设置 margin 和 padding: 内部每个元素只设计跟自己相关的属性,这样方便复用:

  2. linux下 /usr/bin/ld: 找不到 -ldhnetsdk的解决方法

    linux下使用Qt编译程序的时候,安装了程序自带的链接库之后,仍然上报这个错误, 发现系统上报这个错误: /usr/bin/ld: 找不到 -ldhnetsdk 经过仔细的定位,终于解决了,这里把思 ...

  3. undefined 和 undeclared 的区别

    var a; //undefined b; // b is not defined 区别:在变量作用域中已经申明但没有赋值的变量(如 a),是undefined.相反,在变量作用域中没有申明过的变量, ...

  4. appium安装完成后运行和执行python脚本的错误合集

    1.第一个错误如下: main.js: error: argument "--app": Expected one argument. null 这个一般是appium服务端安装的 ...

  5. Ubuntu 16.04下安装谷歌浏览器(转)

    1.进入 Ubuntu 16.04 桌面,按下 Ctrl + Alt + t 键盘组合键,启动终端. 2.在终端中,输入以下命令,将下载源加入到系统的源列表. sudo wget http://www ...

  6. Javascript:alert(1)可以这样写以绕过filter

    在2011年的BlackHat DC 2011大会上Ryan Barnett给出了一段关于XSS的示例javascript代码: ($=[$=[]][(__=!$+$)[_=-~-~-~$]+({}+ ...

  7. Hadoop2源码分析-YARN 的服务库和事件库

    1.概述 在<Hadoop2源码分析-YARN RPC 示例介绍>一文当中,给大家介绍了YARN 的 RPC 机制,以及相关代码的演示,今天我们继续去学习 YARN 的服务库和事件库,分享 ...

  8. Jfinal文件上传基础路径问题,windows下会以项目根路径为基础路径

    在本地windows下开发测试文件上传 使用com.jfinal.cos进行multipart/form-data请求数据格式的文件上传解析 import com.jfinal.upload.Uplo ...

  9. Golang GC原理

    一.内存泄漏 内存泄露,是从操作系统的角度上来阐述的,形象的比喻就是“操作系统可提供给所有进程的存储空间(虚拟内存空间)正在被某个进程榨干”,导致的原因就是程序在运行的时候,会不断地动态开辟的存储空间 ...

  10. Kafka实战解惑

    目录 一. kafka简介二. Kafka架构方案三. Kafka安装四. Kafka Client API 4.1 Producers API 4.2 Consumers API 4.3 消息高可靠 ...