RK3288-OTA编译失败解决办法【转】】的更多相关文章

本文转载自:http://blog.csdn.net/wangxueming/article/details/52448630 在执行make  otapackage的时候出现该错误,是由于drmsigntool的问题,其位于目录build/tools/drmsigntool/下,进入该目录,然后mm  -B,再回到源码根目录下 make otapackage即可.(注:mm命令可能需要在源码根目录下执行. build/envsetup.sh) 另外,若SDK源码不是更新到最新的版本,可能…
Mysql文件太大导入失败解决办法总结 在使用phpmyadmin导入数据库的时候可能会碰到由于数据库文件太大而无法导入的问题! 英文提示如下:File exceeds the maximum allowed size 如果正在使用的主机可以自定义php.ini的话,就可以通过直接修改这个文件来解决,即通过通过编辑php.ini文件来重新设定上传文件大小的限定,具体操作步骤: 第一步:打开php.ini,找到 upload_max_filesize . memory_limit . post_m…
Keil4 每次选build 编译(F7)都全部编译的解决办法 http://blog.csdn.net/wchengshen/article/details/50440079 Keil4 每次选build 编译(F7)都全部编译的解决办法: ocean 验证: project--option for target 'xxx' ---target---Code Generation-- 将Use Cross-Module Optimization勾选去掉 再多重新编译一次就可以了.…
原文:在ASP.net中的UpdatePanel,弹窗失败解决办法 最开始我用: Response.Write("<script>alert('和哈呵呵呵呵呵呵!')</script>"); 在没有UpdatePanel时,这个有效,能够正确弹出提示窗口. 后面,页面改进,加上局部刷新后,该方式失效了.探索出新的方式: ScriptManager.RegisterStartupScript(this.UpdatePanel1, this.GetType(), &…
最近,笔者安装的myeclipse2017破解出了问题,破解本来是很简单的事,就是几步而已,但是一直出问题,现在安利一波myeclipse2017版破解失败解决办法.诸如下图:()因为笔者已经破解好了,所以很多图都是网上找的,可能图文不会很明确,请见谅,若有疑问,可加笔者QQ:2963785535): 接下来我们点击Enter License,会出现如下界面,当然,笔者破解好了,所以显示的稍有不同,破解失败的Activation Status: Product activation··· · ·…
python 安装pytorch 及 安装失败解决办法 [转] pytorch安装失败解决办法 [转] 一分钟在win10终端成功安装pytorch pytorch 的安装方法有2种,一种是pip安装,另一种就是下载whl文件然后本地安装. 方法一:pip安装 或许会想到直接使用 pip install torch 但是这样会报错,安装失败.所以,可以到[官网]找对应版本进行下载. 1. 点击进入官网 2. 点击Get Started,按照自己的配置选择相应的选项,最后复制生成的命令到终端,鼠标…
c++调用动态库失败解决办法 之前写好的程序今天早上过来发现在服务器上出错了,于是就各种查问题,整整一个早上外加下午两个小时都在查这个问题,最终被我找到了问题: 在程序中我发现LoadLibrary()返回的句柄是空的,于是用GetLastError()看了一下,返回值是193,因此可以断定应该是动态库出问题了,所以就用Depends查看了一下程序中依赖的动态库,发现该动态库还缺少另外的一个动态库,导致程序在加载过程中出现了错误,现在才回想起来,之前因为新需求,在原有的动态库上添加新功能,从而调…
Hive中将文件加载到数据库表失败解决办法(hive创建表失败) 遇到的问题: FAILED: Execution Error, return code 1 from org.apache.hadoop.hive.ql.exec.DDLTask. MetaException(message:Got exception: java.net.ConnectException Call From dblab-VirtualBox/127.0.1.1 to localhost:9000 failed o…
今天用AndroidStudio开发了一个手机App玩玩,但是偶然遇到一个问题,自己手机上测试得劲的很,分享给朋友做测试,但是nie,意外出现了.... 两个人都给我说个安装失败,这个就比较尴尬了,找了半天,按照网上找了很多方法都没有解决. 最后看一下错误信息,有句话比较显眼" INSTALL_FAILED_TEST_ONLY." 百度搜了一下这个,然后找到了解决办法 需要把 Android Studio中将testOnly功能关掉. 具体关掉的方法如下 打开AndroidStudio…
今天想在本地测试网站源码能否正常运行,如果可以就转空间了,然而下载了APMServ之后发现系统Apache.MySQL5.1启动均失败,小白的人表示只能借助百度,用了一个小时的时间终于解决了,虽然坎坷,但还是欣慰,为了防止以后再发生类似的事情到处百度,还是决定把解决办法记录下来.     首先,在电脑左下角找到“运行”程序,输入“regedit”打开系统注册表     找到:HKEY_LOCAL_MACHINE\SYSTEM\CurrentControlSet\services\HTTP,点击H…
错误信息: >------ 已启动生成: 项目: testCrypto++, 配置: Debug Win32 ------ >正在编译... >main.cpp >正在链接... >cryptlib.lib(rijndael.obj) : error LNK2005: ?$basic_string@DU?$char_traits@D@std@@V?$allocator@D@@@std@@QAE@PBD@Z) 已经在 msvcprtd.lib(MSVCP90D.dll) 中定义…
原文:http://www    .zuidaima.com/question/2535347150441472.htm maven依赖包下载失败 比如:Missing artifact org.codehaus.jackson:jackson-mapper-asl:jar:1.9.9 这种问题即使使用Project=>Clean来重新Buil项目都不行,因为这个操作是属于项目重新编译,而该问题是依赖包问题,所以只有在依赖包正常的情况下操作才会成功,解决办法就是maven clean 操作步骤如…
今天在更新项目的时候遇到一个问题,按惯例要cleanup才能重新更新.但是很不幸,在cleanup的时候又遇到了问题! 1    svn cleanup failed–previous operation has not finished; run cleanup if it was interrupted 要更新先要cleanup,但是cleanup的失败信息又叫我cleanup--这是一个死循环!本着"内事不决问百度,外事不决问Google"的原则,终于找到一个解决办法,参见这里:…
首先安装失败会有提示 首先贴下错误信息 Exit Code: 34 Please see specific errors below for troubleshooting. For example, ERROR: -------------------------------------- Summary -------------------------------------- - 1 fatal error(s), 0 error(s) FATAL: Payload 'Camera Pr…
今天由于没有正常关闭虚拟机,导致出现打开虚拟机提示:锁定文件失败 虚拟机开启模块snapshot失败,后来从网上找打了资料解决了.解决办法:一:打开你存放虚拟机系统文件的文件夹,注意,是系统文件,不是虚拟机的安装目录,也就是你建立虚拟机的时候下图设置的位置 二:用下面关键字搜索这个文件夹:*.lck 如图: 找到这三个文件删除即可 四:问题解决了…
今天下午,很奇怪的网站突然就打不开了,报错如下: “/”应用程序中的服务器错误. 用户 'sa' 登录失败. 说明: 执行当前 Web 请求期间,出现未处理的异常.请检查堆栈跟踪信息,以了解有关该错误以及代码中导致错误的出处的详细信息. 异常详细信息: System.Data.SqlClient.SqlException: 用户 'sa' 登录失败. 源错误: 执行当前 Web 请求期间生成了未处理的异常.可以使用下面的异常堆栈跟踪信息确定有关异常原因和发生位置的信息. 堆栈跟踪: [SqlEx…
近期想学习Ngnix 代码,前些日子,对”自己下手狠一次“, 买了MAC 本. 所以想在Mac 上编译,是必须的,不然对不起自己的内心. 不巧遇到了MD5算法编译的问题 src/core/ngx_crypt.c::: error: 'MD5_Init' is deprecated: first deprecated in OS X 10.7 [-Werror,-Wdeprecated-declarations] ngx_md5_init(&md5); ^ src/core/ngx_md5.h::…
好久没有碰ps,看了下在ps版本都到cc了.忍不住也想尝试最新版本,但是安装出现了很多问题,导致我花了很多时间才搞定,现在分享给大家几点经验吧. Exit Code: Please see specific errors below for troubleshooting. For example, ERROR: -------------------------------------- Summary -------------------------------------- - fata…
解决关于C-Free 5.0编译时提示错误:[Error] undefined reference to `__dyn_tls_init_callback' 解决办法: 因为错误提示的路径是C:\MinGW\..... 首先想到的是编译器出问题了,因为我在安装完C-Free 5.0后,重新装过MinGW编译器,模模糊糊的感觉记不清楚, 一开始只是以为重装C-Free 5.0就好了,结果并没有用.根据百度得到的方法之一就是删除C-Free 5.0的注册表,然后重新打开可解决.结果还是没用. 后面是…
最近在学习python爬虫技术,lxml模块拥有很强大的获取元素功能,但是安装时总超时报错,如下解决办法 选择好python版本→注意pip版本→下载对应lxml.whl→键入对应的字符串→bingo 1.去网站下载lxml,找到对应的版本 http://www.lfd.uci.edu/~gohlke/pythonlibs/#lxml 注解:cp35,表示支持python3.5    win64代表位数 ''''''''''''''''''''''''''''''''''''''''''''''…
为什么要安装虚拟环境? 1.某些项目需要安装旧的包,开发相应功能 2.项目开发时,安装部分环境不希望影响整机环境 如何安装? 首先安装python 安装pip工具 sudo apt-get install python sudo apt-get install python-pip 使用pip安装 pip install virtualenv 创建文件夹开启 mkdir flask_venv cd flask_venv virtualenv venv 这儿可能会失败: 1,错误代码2,URL无法…
在换了固态硬盘后,下载好VM,装虚拟机,结果克隆虚拟机和拍摄快照时出问题了. 拍摄快照时出错或者隆失败出现参数错误如图: 所提供的参数中有一个无效参数 解决办法 出现这个问题一般是在机械硬盘的电脑上面加装了固态,并且VM所在的桌面在固态硬盘,而Linux系统装在了机械硬盘上面,导致冲突. 解决办法就是重装吧,把系统装也在固态上面,所以还是去买个大容量的固态吧.…
写在前面,如果是用win10系统的用户,一定要先通过管理员模式打开命令窗口,我是直接按 win + x 键,选择 "Windows Powershell(管理员)",否则会提示: [Errno 13] Permission denied: 下面是在管理员模式下通过 pip 命令安装失败 从下面错误来看,是安装build的依赖失败,但具体是哪些也不清楚,网上找也没有类似错误的解决办法,大都都是下载setup.py文件来安装 Windows PowerShell 版权所有 (C) Micr…
electron官网提供的demo项目,在npm install 的时候总是报错显示安装失败, 解决办法:FQ即可成功安装.…
最近因为项目需要使用到Centos,自己经常使用Chrome,所有的书签以及信息都是同步在Google,所以尝试在Centos上安装Chrome,按照网上的资料都是安装失败,显示缺少资源,不过最终还是找到一个解决办法,就是安装开发版Chrome,具体方法如下: yum install http://people.centos.org/hughesjr/chromium/6/x86_64/RPMS/chromium-28.0.1500.52-207119.x86_64.rpm…
直接运行cmd,运行arp -d * ,arp -s会出现下面的错误提示: ARP 项删除失败: 请求的操作需要提升. ARP 项添加失败: 拒绝访问.或提示:ARP 项添加失败: 请求的操作需要提升. (英文版提示:The ARP entry addition failed: Access is denied. ) 如何解决呢? 运行arp -d * 需要用管理员身份运行,进入windows\system32文件夹找到cmd.exe,右键"以管理员身份运行",这样打开cmd程序就能运…
错误信息如下: PHP Warning: PHP Startup: redis: Unable to initialize module Module compiled with module API=20050922 PHP compiled with module API=20090626 These options need to match in Unknown on line 0 首先先说下这种错误出现的原因: 执行编译源码包执行phpize的版本与当前php环境中phpize的版本不…
最近在做.net项目,因为本人以前做java较多,所以对.net不熟悉,在项目完成后部署到IIS服务器上出现诸多问题,以上其中之一,若有时间,在更新其他问题的解决办法! 异常详细信息: System.Data.SqlClient.SqlException: 用户 'NT AUTHORITY\IUSR' 登录失败  或者 异常详细信息: System.Data.SqlClient.SqlException: 用户 'sa' 登录失败, 如果各种方法,比如web.config中配置用户名和密码正确,…
在AImpl.java文件中引用BImpl.java的方法,编译正常,运行到调用的地方,报空指针异常,跟踪到异常位置,发现service为空,也就是按照之前controller层通过@Autowired注入service层失效. 解决办法: 在AImpl.java类中添加标红代码: @Componentpublic class AImpl { @Autowired protected SequenceClient sequenceClient; private static SequenceIm…
通过phpmyadmin连接mysql成功,但是通过php连接数据库失败,执行如下php语句 ? 1 @mysql_connect("localhost","root","12345") or die ("数据库服务器连接失败");// 连接服务器 之后,浏览器输出数据库服务器连接失败,下文为解决办法. 1.Mac的MySql安装路径为,*为版本号,是数字. ? 1 /usr/local/mysql_******_osx10.…