今天介绍一个在laravel5.5新版本整合jwt  执行 php artisan jwt:generate 再生成密钥时报的一个错误 Method Tymon\JWTAuth\Commands\JWTGenerateCommand::handle() does not exist   导致这个的原因是因为jwt版本与laravel版本冲突  这时候我们只需要找到config/app.php下的这一段代码删除掉 Tymon\JWTAuth\Providers\JWTAuthServiceProv…
问题描述 今天做一个前端项目,安装幻灯片插件vue-awesome-swiper后 运行npm run dev 后报错如下: `ERROR Could not compile template E:\java\JavaWorkSpace\OnlineEducation\WebReview\vue-front-1010\node_modules\@nuxt\vue-app\template\App.js: Cannot resolve "swiper/dist/css/swiper.css&quo…
spring+hibernate整合:报错信息如下 org.hibernate.HibernateException: No Session found for current thread at org.springframework.orm.hibernate4.SpringSessionContext.currentSession(SpringSessionContext.java:106) at org.hibernate.internal.SessionFactoryImpl.getC…
weblogic 整合cxf 报错:cannot create a secure XmlInputFactory ================================ ©Copyright 蕃薯耀 2018年5月17日 https://www.cnblogs.com/fanshuyao/ 一.问题描述 weblogic10 整合cxf 启动时报错: cannot create a secure XmlInputFactory 报错原因: 原因应该是weblogic里面自带的jax-w…
今天spring整合quartz报错,最后一步步排查,发现是和redis依赖冲突,最后redis升级了一下,问题解决. 总结:发现问题,逐一排查,如果是整合问题,报类加载不到的错误,大概率是和其他组件依赖冲突,找到冲突源,解决即可.…
Springboot整合Elasticsearch报错 今天使用SpringBoot整合Elasticsearch时候,相关的配置完成后,启动项目就报错了. nested exception is java.lang.IllegalStateException: availableProcessors is already set to [4], rejecting [4] 我网上查询了一下,有人是是因为整合了Redis的原因.但是我把Redis相关的配置去掉后,问题还是没有解决,最后有人说是因…
原文链接:https://blog.csdn.net/weixin_43724369/article/details/89341949 SpringBoot整合Swagger2案例 先说SpringBoot如何整合Swagger2,然后再说报错问题. 用IDEA新建SpringBoot项目,只需勾选Web即可. 在项目的pom文件中添加Swagger2相关依赖 <!--引入两个Swagger2相关的依赖--> <dependency> <groupId>io.sprin…
编译报错LINK : fatal error LNK1000: Internal error during Incr的解决 Win7 旗舰版 Microsoft Visual Studio 2008 SP1 (VC++ 2008) 看文后,抱着试试看的想法,先走正统之路下补丁,结果:一样提示“此计算机上没有安装本软件更新支持的产品.单击“取消”退出安装程序.” 看来:补丁之路不通,若是这个编号VS90-KB948127的,大家就不要试了 以下为原文: 返回错误:LINK : fatal erro…
selenium+phantomjs报错:Unable to find a free port的分析和解决 Table of Contents 1. 现象 2. 分析 3. 解决办法 1 现象 在做项目时,发现在某台机器上使用selenium+phantomjs时报如下错误: java.lang.RuntimeException: Unable to find a free port at org.openqa.selenium.net.PortProber.findFreePort(PortP…
输入指令npx webpack-dev-server报错:Error: Cannot find module 'webpack-cli/bin/config-yargs'的解决方法 输入指令:npx webpack-dev-server显示如下报错信息: C:\Users\ASUS\Desktop\JavaScript 代码\webpack实验>npx webpack-dev-server internal/modules/cjs/loader.js:983 throw err; ^ Error…